BDBM50201330 1-(4-(4-amino-7-(pyridin-4-yl)thieno[3,2-c]pyridin-3-yl)phenyl)-3-m-tolylurea::CHEMBL268826
SMILES: Cc1cccc(NC(=O)Nc2ccc(cc2)-c2csc3c(cnc(N)c23)-c2ccncc2)c1
InChI Key: InChIKey=ZOJHQITYHCHCCD-UHFFFAOYSA-N
Data: 2 IC50
Activity Spreadsheet -- Enzyme Inhibition Constant Data from BindingDB
Found 2 hits for monomerid = 50201330
Trg + Lig
Ki
nM
ΔG°
kcal/mole
IC50
nM
Kd
nM
EC50/IC50
nM
koff
s-1
kon
M-1s-1
pHTemp
°C
Vascular endothelial growth factor receptor 2
(Homo sapiens (Human))
BDBM50201330
(1-(4-(4-amino-7-(pyridin-4-yl)thieno[3,2-c]pyridin...)
Show SMILES Cc1cccc(NC(=O)Nc2ccc(cc2)-c2csc3c(cnc(N)c23)-c2ccncc2)c1
Show InChI InChI=1S/C26H21N5OS/c1-16-3-2-4-20(13-16)31-26(32)30-19-7-5-17(6-8-19)22-15-33-24-21(14-29-25(27)23(22)24)18-9-11-28-12-10-18/h2-15H,1H3,(H2,27,29)(H2,30,31,32)
NCI pathway
Reactome pathway
n/an/a 5n/an/an/an/an/an/a
Abbott Laboratories
Curated by ChEMBL
Assay Description
Inhibition of KDR
Bioorg Med Chem Lett 17: 1246-9 (2007)
Article DOI: 10.1016/j.bmcl.2006.12.015
BindingDB Entry DOI: 10.7270/Q28K78RS
Vascular endothelial growth factor receptor 2
(Homo sapiens (Human))
BDBM50201330
(1-(4-(4-amino-7-(pyridin-4-yl)thieno[3,2-c]pyridin...)
Show SMILES Cc1cccc(NC(=O)Nc2ccc(cc2)-c2csc3c(cnc(N)c23)-c2ccncc2)c1
Show InChI InChI=1S/C26H21N5OS/c1-16-3-2-4-20(13-16)31-26(32)30-19-7-5-17(6-8-19)22-15-33-24-21(14-29-25(27)23(22)24)18-9-11-28-12-10-18/h2-15H,1H3,(H2,27,29)(H2,30,31,32)
NCI pathway
Reactome pathway
n/an/a 4n/an/an/an/an/an/a
Abbott Laboratories
Curated by ChEMBL
Assay Description
Inhibition of human KDR phosphorylation in NIH3T3 cells
Bioorg Med Chem Lett 17: 1246-9 (2007)
Article DOI: 10.1016/j.bmcl.2006.12.015
BindingDB Entry DOI: 10.7270/Q28K78RS