BDBM50201649 CHEMBL3914181
SMILES: CCS(=O)(=O)c1cc(Nc2ncc(F)c(n2)N(Cc2ccccc2)c2cc(CO)ccc2C)ccc1N1CCN(C)CC1
InChI Key: InChIKey=ZMBVLMGGQSTPCK-UHFFFAOYSA-N
Data: 2 IC50
Activity Spreadsheet -- Enzyme Inhibition Constant Data from BindingDB
Found 2 hits for monomerid = 50201649
Trg + Lig
Ki
nM
ΔG°
kcal/mole
IC50
nM
Kd
nM
EC50/IC50
nM
koff
s-1
kon
M-1s-1
pHTemp
°C
PAK 1/CDC42
(Homo sapiens (Human))
BDBM50201649
(CHEMBL3914181)
Show SMILES CCS(=O)(=O)c1cc(Nc2ncc(F)c(n2)N(Cc2ccccc2)c2cc(CO)ccc2C)ccc1N1CCN(C)CC1
Show InChI InChI=1S/C32H37FN6O3S/c1-4-43(41,42)30-19-26(12-13-28(30)38-16-14-37(3)15-17-38)35-32-34-20-27(33)31(36-32)39(21-24-8-6-5-7-9-24)29-18-25(22-40)11-10-23(29)2/h5-13,18-20,40H,4,14-17,21-22H2,1-3H3,(H,34,35,36)
n/an/a 1.5n/an/an/an/an/an/a
AstraZeneca
Curated by ChEMBL
Assay Description
Inhibition of PAK1 (unknown origin) by ATP-kinaseGlo assay
ACS Med Chem Lett 7: 1118-1123 (2016)
Article DOI: 10.1021/acsmedchemlett.6b00322
BindingDB Entry DOI: 10.7270/Q2PV6NCH
PAK 1/CDC42
(Homo sapiens (Human))
BDBM50201649
(CHEMBL3914181)
Show SMILES CCS(=O)(=O)c1cc(Nc2ncc(F)c(n2)N(Cc2ccccc2)c2cc(CO)ccc2C)ccc1N1CCN(C)CC1
Show InChI InChI=1S/C32H37FN6O3S/c1-4-43(41,42)30-19-26(12-13-28(30)38-16-14-37(3)15-17-38)35-32-34-20-27(33)31(36-32)39(21-24-8-6-5-7-9-24)29-18-25(22-40)11-10-23(29)2/h5-13,18-20,40H,4,14-17,21-22H2,1-3H3,(H,34,35,36)
n/an/a 230n/an/an/an/an/an/a
AstraZeneca
Curated by ChEMBL
Assay Description
Inhibition of PAK1 phosphorylation in human MCF10A cells
ACS Med Chem Lett 7: 1118-1123 (2016)
Article DOI: 10.1021/acsmedchemlett.6b00322
BindingDB Entry DOI: 10.7270/Q2PV6NCH