BDBM50201705 (1R,2S)-2-(benzyloxy)-7-oxa-5-aza-bicyclo[3.2.1]octan-6-one::CHEMBL390475
SMILES: O=C1O[C@@H]2CN1CC[C@@H]2OCc1ccccc1
InChI Key: InChIKey=CFOTUZHUTFRFQA-NWDGAFQWSA-N
Data: 9 IC50
Activity Spreadsheet -- Enzyme Inhibition Constant Data from BindingDB
Found 9 hits for monomerid = 50201705
Trg + Lig
Ki
nM
ΔG°
kcal/mole
IC50
nM
Kd
nM
EC50/IC50
nM
koff
s-1
kon
M-1s-1
pHTemp
°C
Dipeptidyl peptidase I
(Homo sapiens (Human))
BDBM50201705
((1R,2S)-2-(benzyloxy)-7-oxa-5-aza-bicyclo[3.2.1]oc...)
Show SMILES O=C1O[C@@H]2CN1CC[C@@H]2OCc1ccccc1
Show InChI InChI=1S/C13H15NO3/c15-13-14-7-6-11(12(8-14)17-13)16-9-10-4-2-1-3-5-10/h1-5,11-12H,6-9H2/t11-,12+/m0/s1
n/an/a 403n/an/an/an/an/an/a
The Genomics Institute of the Novartis Research Foundation
Curated by ChEMBL
Assay Description
Inhibition of human recombinant cathepsin C
Bioorg Med Chem Lett 17: 1254-9 (2007)
Article DOI: 10.1016/j.bmcl.2006.12.014
BindingDB Entry DOI: 10.7270/Q2QN66DT
Cathepsin K
(Homo sapiens (Human))
BDBM50201705
((1R,2S)-2-(benzyloxy)-7-oxa-5-aza-bicyclo[3.2.1]oc...)
Show SMILES O=C1O[C@@H]2CN1CC[C@@H]2OCc1ccccc1
Show InChI InChI=1S/C13H15NO3/c15-13-14-7-6-11(12(8-14)17-13)16-9-10-4-2-1-3-5-10/h1-5,11-12H,6-9H2/t11-,12+/m0/s1
Reactome pathway
n/an/a 511n/an/an/an/an/an/a
The Genomics Institute of the Novartis Research Foundation
Curated by ChEMBL
Assay Description
Inhibition of human recombinant cathepsin K
Bioorg Med Chem Lett 17: 1254-9 (2007)
Article DOI: 10.1016/j.bmcl.2006.12.014
BindingDB Entry DOI: 10.7270/Q2QN66DT
Pro-cathepsin H
(Homo sapiens (Human))
BDBM50201705
((1R,2S)-2-(benzyloxy)-7-oxa-5-aza-bicyclo[3.2.1]oc...)
Show SMILES O=C1O[C@@H]2CN1CC[C@@H]2OCc1ccccc1
Show InChI InChI=1S/C13H15NO3/c15-13-14-7-6-11(12(8-14)17-13)16-9-10-4-2-1-3-5-10/h1-5,11-12H,6-9H2/t11-,12+/m0/s1
n/an/a>1.00E+4n/an/an/an/an/an/a
The Genomics Institute of the Novartis Research Foundation
Curated by ChEMBL
Assay Description
Inhibition of human recombinant cathepsin H
Bioorg Med Chem Lett 17: 1254-9 (2007)
Article DOI: 10.1016/j.bmcl.2006.12.014
BindingDB Entry DOI: 10.7270/Q2QN66DT
Cathepsin F
(Homo sapiens (Human))
BDBM50201705
((1R,2S)-2-(benzyloxy)-7-oxa-5-aza-bicyclo[3.2.1]oc...)
Show SMILES O=C1O[C@@H]2CN1CC[C@@H]2OCc1ccccc1
Show InChI InChI=1S/C13H15NO3/c15-13-14-7-6-11(12(8-14)17-13)16-9-10-4-2-1-3-5-10/h1-5,11-12H,6-9H2/t11-,12+/m0/s1
Reactome pathway
n/an/a 3.76E+3n/an/an/an/an/an/a
The Genomics Institute of the Novartis Research Foundation
Curated by ChEMBL
Assay Description
Inhibition of human recombinant cathepsin F
Bioorg Med Chem Lett 17: 1254-9 (2007)
Article DOI: 10.1016/j.bmcl.2006.12.014
BindingDB Entry DOI: 10.7270/Q2QN66DT
Cathepsin K
(Homo sapiens (Human))
BDBM50201705
((1R,2S)-2-(benzyloxy)-7-oxa-5-aza-bicyclo[3.2.1]oc...)
Show SMILES O=C1O[C@@H]2CN1CC[C@@H]2OCc1ccccc1
Show InChI InChI=1S/C13H15NO3/c15-13-14-7-6-11(12(8-14)17-13)16-9-10-4-2-1-3-5-10/h1-5,11-12H,6-9H2/t11-,12+/m0/s1
Reactome pathway
n/an/a 547n/an/an/an/an/an/a
The Genomics Institute of the Novartis Research Foundation
Curated by ChEMBL
Assay Description
Inhibition of human recombinant cathepsin X
Bioorg Med Chem Lett 17: 1254-9 (2007)
Article DOI: 10.1016/j.bmcl.2006.12.014
BindingDB Entry DOI: 10.7270/Q2QN66DT
Procathepsin L
(Homo sapiens (Human))
BDBM50201705
((1R,2S)-2-(benzyloxy)-7-oxa-5-aza-bicyclo[3.2.1]oc...)
Show SMILES O=C1O[C@@H]2CN1CC[C@@H]2OCc1ccccc1
Show InChI InChI=1S/C13H15NO3/c15-13-14-7-6-11(12(8-14)17-13)16-9-10-4-2-1-3-5-10/h1-5,11-12H,6-9H2/t11-,12+/m0/s1
Reactome pathway
n/an/a 263n/an/an/an/an/an/a
The Genomics Institute of the Novartis Research Foundation
Curated by ChEMBL
Assay Description
Inhibition of human recombinant cathepsin L
Bioorg Med Chem Lett 17: 1254-9 (2007)
Article DOI: 10.1016/j.bmcl.2006.12.014
BindingDB Entry DOI: 10.7270/Q2QN66DT
Cathepsin L2
(Homo sapiens (Human))
BDBM50201705
((1R,2S)-2-(benzyloxy)-7-oxa-5-aza-bicyclo[3.2.1]oc...)
Show SMILES O=C1O[C@@H]2CN1CC[C@@H]2OCc1ccccc1
Show InChI InChI=1S/C13H15NO3/c15-13-14-7-6-11(12(8-14)17-13)16-9-10-4-2-1-3-5-10/h1-5,11-12H,6-9H2/t11-,12+/m0/s1
n/an/a 1.29E+3n/an/an/an/an/an/a
The Genomics Institute of the Novartis Research Foundation
Curated by ChEMBL
Assay Description
Inhibition of human recombinant cathepsin V
Bioorg Med Chem Lett 17: 1254-9 (2007)
Article DOI: 10.1016/j.bmcl.2006.12.014
BindingDB Entry DOI: 10.7270/Q2QN66DT
Cathepsin S
(Homo sapiens (Human))
BDBM50201705
((1R,2S)-2-(benzyloxy)-7-oxa-5-aza-bicyclo[3.2.1]oc...)
Show SMILES O=C1O[C@@H]2CN1CC[C@@H]2OCc1ccccc1
Show InChI InChI=1S/C13H15NO3/c15-13-14-7-6-11(12(8-14)17-13)16-9-10-4-2-1-3-5-10/h1-5,11-12H,6-9H2/t11-,12+/m0/s1
Reactome pathway
n/an/a 174n/an/an/an/an/an/a
The Genomics Institute of the Novartis Research Foundation
Curated by ChEMBL
Assay Description
Inhibition of human recombinant cathepsin S
Bioorg Med Chem Lett 17: 1254-9 (2007)
Article DOI: 10.1016/j.bmcl.2006.12.014
BindingDB Entry DOI: 10.7270/Q2QN66DT
Cathepsin B
(Homo sapiens (Human))
BDBM50201705
((1R,2S)-2-(benzyloxy)-7-oxa-5-aza-bicyclo[3.2.1]oc...)
Show SMILES O=C1O[C@@H]2CN1CC[C@@H]2OCc1ccccc1
Show InChI InChI=1S/C13H15NO3/c15-13-14-7-6-11(12(8-14)17-13)16-9-10-4-2-1-3-5-10/h1-5,11-12H,6-9H2/t11-,12+/m0/s1
Reactome pathway
n/an/a 2n/an/an/an/an/an/a
The Genomics Institute of the Novartis Research Foundation
Curated by ChEMBL
Assay Description
Inhibition of human recombinant cathepsin B
Bioorg Med Chem Lett 17: 1254-9 (2007)
Article DOI: 10.1016/j.bmcl.2006.12.014
BindingDB Entry DOI: 10.7270/Q2QN66DT