BDBM50201717 CHEMBL3907591
SMILES: Nc1ncnc2n(nc(-c3cc(O)c(F)c(F)c3)c12)C1Cc2ccccc2C1
InChI Key: InChIKey=VTASVRIYSRXJCL-UHFFFAOYSA-N
Data: 2 IC50
Activity Spreadsheet -- Enzyme Inhibition Constant Data from BindingDB
Found 2 hits for monomerid = 50201717
Trg + Lig
Ki
nM
ΔG°
kcal/mole
IC50
nM
Kd
nM
EC50/IC50
nM
koff
s-1
kon
M-1s-1
pHTemp
°C
Phosphatidylinositol 4,5-bisphosphate 3-kinase catalytic subunit delta isoform
(Homo sapiens (Human))
BDBM50201717
(CHEMBL3907591)
Show SMILES Nc1ncnc2n(nc(-c3cc(O)c(F)c(F)c3)c12)C1Cc2ccccc2C1
Show InChI InChI=1S/C20H15F2N5O/c21-14-7-12(8-15(28)17(14)22)18-16-19(23)24-9-25-20(16)27(26-18)13-5-10-3-1-2-4-11(10)6-13/h1-4,7-9,13,28H,5-6H2,(H2,23,24,25)
NCI pathway
Reactome pathway
n/an/a 3n/an/an/an/an/an/a
Pvt. Ltd.
Curated by ChEMBL
Assay Description
Inhibition of PI3Kdelta (unknown origin) using biotinylated PIP2 as substrate in presence of streptavidin-APC by FRET assay
ACS Med Chem Lett 7: 1161-1166 (2016)
Article DOI: 10.1021/acsmedchemlett.6b00356
BindingDB Entry DOI: 10.7270/Q29K4D6F
Tyrosine-protein kinase BTK
(Homo sapiens (Human))
BDBM50201717
(CHEMBL3907591)
Show SMILES Nc1ncnc2n(nc(-c3cc(O)c(F)c(F)c3)c12)C1Cc2ccccc2C1
Show InChI InChI=1S/C20H15F2N5O/c21-14-7-12(8-15(28)17(14)22)18-16-19(23)24-9-25-20(16)27(26-18)13-5-10-3-1-2-4-11(10)6-13/h1-4,7-9,13,28H,5-6H2,(H2,23,24,25)
NCI pathway
Reactome pathway
n/an/a 27n/an/an/an/an/an/a
Pvt. Ltd.
Curated by ChEMBL
Assay Description
Inhibition of human BTK using KVEKIGEGTYGVVYK as substrate after 20 mins by [gamma-33P]ATP based assay
ACS Med Chem Lett 7: 1161-1166 (2016)
Article DOI: 10.1021/acsmedchemlett.6b00356
BindingDB Entry DOI: 10.7270/Q29K4D6F