BDBM50201750 CHEMBL3903088
SMILES: Fc1cccc(c1)C(=O)CN1C(=O)C2(OCCO2)c2ccccc12
InChI Key: InChIKey=NTKXSBSMEIBBDP-UHFFFAOYSA-N
Data: 1 IC50
Activity Spreadsheet -- Enzyme Inhibition Constant Data from BindingDB
Found 1 hit for monomerid = 50201750
Trg + Lig
Ki
nM
ΔG°
kcal/mole
IC50
nM
Kd
nM
EC50/IC50
nM
koff
s-1
kon
M-1s-1
pHTemp
°C
N-acetyltransferase Eis
(Mycobacterium tuberculosis (strain ATCC 25618 / H3...)
BDBM50201750
(CHEMBL3903088)
Show SMILES Fc1cccc(c1)C(=O)CN1C(=O)C2(OCCO2)c2ccccc12
Show InChI InChI=1S/C18H14FNO4/c19-13-5-3-4-12(10-13)16(21)11-20-15-7-2-1-6-14(15)18(17(20)22)23-8-9-24-18/h1-7,10H,8-9,11H2
n/an/a 300n/an/an/an/an/an/a
University of Kentucky
Curated by ChEMBL
Assay Description
Inhibition of Mycobacterium tuberculosis H37Rv Eis expressed in Escherichia coli BL21(DE3) using Acetyl-CoA as substrate preincubated for 10 mins fol...
ACS Med Chem Lett 7: 1219-1221 (2016)
Article DOI: 10.1021/acsmedchemlett.6b00261
BindingDB Entry DOI: 10.7270/Q2251M51