BDBM50201757 CHEMBL3958709
SMILES: COC(=O)c1cc2occc2n1CC(=O)c1ccccc1
InChI Key: InChIKey=YOOCCMKMNTXLIK-UHFFFAOYSA-N
Data: 1 IC50
Activity Spreadsheet -- Enzyme Inhibition Constant Data from BindingDB
Found 1 hit for monomerid = 50201757
Trg + Lig
Ki
nM
ΔG°
kcal/mole
IC50
nM
Kd
nM
EC50/IC50
nM
koff
s-1
kon
M-1s-1
pHTemp
°C
N-acetyltransferase Eis
(Mycobacterium tuberculosis (strain ATCC 25618 / H3...)
BDBM50201757
(CHEMBL3958709)
Show SMILES COC(=O)c1cc2occc2n1CC(=O)c1ccccc1
Show InChI InChI=1S/C16H13NO4/c1-20-16(19)13-9-15-12(7-8-21-15)17(13)10-14(18)11-5-3-2-4-6-11/h2-9H,10H2,1H3
n/an/a 3.00E+3n/an/an/an/an/an/a
University of Kentucky
Curated by ChEMBL
Assay Description
Inhibition of Mycobacterium tuberculosis H37Rv Eis expressed in Escherichia coli BL21(DE3) using Acetyl-CoA as substrate preincubated for 10 mins fol...
ACS Med Chem Lett 7: 1219-1221 (2016)
Article DOI: 10.1021/acsmedchemlett.6b00261
BindingDB Entry DOI: 10.7270/Q2251M51