BDBM50201804 CHEMBL3952328
SMILES: CCOC(=O)c1c(C)[nH]c(\C=C2/S\C(=N/c3ccccc3F)N(C2=O)c2ccccc2F)c1C
InChI Key: InChIKey=RUFHHFGIYHKAHI-OGKQLAPOSA-N
Data: 1 IC50
Activity Spreadsheet -- Enzyme Inhibition Constant Data from BindingDB
Found 1 hit for monomerid = 50201804
Trg + Lig
Ki
nM
ΔG°
kcal/mole
IC50
nM
Kd
nM
EC50/IC50
nM
koff
s-1
kon
M-1s-1
pHTemp
°C
Dual specificity phosphatase Cdc25B
(Homo sapiens (Human))
BDBM50201804
(CHEMBL3952328)
Show SMILES CCOC(=O)c1c(C)[nH]c(\C=C2/S\C(=N/c3ccccc3F)N(C2=O)c2ccccc2F)c1C
Show InChI InChI=1S/C25H21F2N3O3S/c1-4-33-24(32)22-14(2)19(28-15(22)3)13-21-23(31)30(20-12-8-6-10-17(20)27)25(34-21)29-18-11-7-5-9-16(18)26/h5-13,28H,4H2,1-3H3/b21-13-,29-25-
Reactome pathway
n/an/a 3.70n/an/an/an/an/an/a
Xi'an Jiaotong University
Curated by ChEMBL
Assay Description
Inhibition of human recombinant GST-tagged CDC25B assessed as reduction in dephosphorylation of florigenic phosphatase substrate preincubated for 1 h...
Eur J Med Chem 122: 756-769 (2016)
Article DOI: 10.1016/j.ejmech.2016.05.060
BindingDB Entry DOI: 10.7270/Q25Q4Z2D