BDBM50201914 2-(4-bromophenyl)-3-hydroxy-7,8-dimethylquinoline-4-carboxylicacid::CHEMBL374432
SMILES: Cc1ccc2c(C(O)=O)c(O)c(nc2c1C)-c1ccc(Br)cc1
InChI Key: InChIKey=MAXSDIJNUWLJJI-UHFFFAOYSA-N
Data: 2 IC50
Activity Spreadsheet -- Enzyme Inhibition Constant Data from BindingDB
Found 2 hits for monomerid = 50201914
Trg + Lig
Ki
nM
ΔG°
kcal/mole
IC50
nM
Kd
nM
EC50/IC50
nM
koff
s-1
kon
M-1s-1
pHTemp
°C
P-selectin/P-selectin glycoprotein ligand 1
(Homo sapiens (Human))
BDBM50201914
(2-(4-bromophenyl)-3-hydroxy-7,8-dimethylquinoline-...)
Show SMILES Cc1ccc2c(C(O)=O)c(O)c(nc2c1C)-c1ccc(Br)cc1
Show InChI InChI=1S/C18H14BrNO3/c1-9-3-8-13-14(18(22)23)17(21)16(20-15(13)10(9)2)11-4-6-12(19)7-5-11/h3-8,21H,1-2H3,(H,22,23)
NCI pathway
Reactome pathway
n/an/a 4.00E+5n/an/an/an/an/an/a
Wyeth Research
Curated by ChEMBL
Assay Description
Inhibition of P-selectin-mediated adhesion of HL60 cells
J Med Chem 50: 21-39 (2007)
Article DOI: 10.1021/jm0602256
BindingDB Entry DOI: 10.7270/Q2Z60PVV
Dihydroorotate dehydrogenase
(Homo sapiens (Human))
BDBM50201914
(2-(4-bromophenyl)-3-hydroxy-7,8-dimethylquinoline-...)
Show SMILES Cc1ccc2c(C(O)=O)c(O)c(nc2c1C)-c1ccc(Br)cc1
Show InChI InChI=1S/C18H14BrNO3/c1-9-3-8-13-14(18(22)23)17(21)16(20-15(13)10(9)2)11-4-6-12(19)7-5-11/h3-8,21H,1-2H3,(H,22,23)
Reactome pathway
n/an/a 5.60E+4n/an/an/an/an/an/a
Wyeth Research
Curated by ChEMBL
Assay Description
Inhibition of human recombinant DHOD expressed in Escherichia coli
J Med Chem 50: 21-39 (2007)
Article DOI: 10.1021/jm0602256
BindingDB Entry DOI: 10.7270/Q2Z60PVV