BDBM50201922 2-(4-chlorophenyl)-3-hydroxy-6-phenylquinoline-4-carboxylic acid::CHEMBL384983
SMILES: OC(=O)c1c(O)c(nc2ccc(cc12)-c1ccccc1)-c1ccc(Cl)cc1
InChI Key: InChIKey=HRKKYWKPZVNMQI-UHFFFAOYSA-N
Data: 2 IC50
Activity Spreadsheet -- Enzyme Inhibition Constant Data from BindingDB
Found 2 hits for monomerid = 50201922
Trg + Lig
Ki
nM
ΔG°
kcal/mole
IC50
nM
Kd
nM
EC50/IC50
nM
koff
s-1
kon
M-1s-1
pHTemp
°C
Dihydroorotate dehydrogenase
(Homo sapiens (Human))
BDBM50201922
(2-(4-chlorophenyl)-3-hydroxy-6-phenylquinoline-4-c...)
Show SMILES OC(=O)c1c(O)c(nc2ccc(cc12)-c1ccccc1)-c1ccc(Cl)cc1
Show InChI InChI=1S/C22H14ClNO3/c23-16-9-6-14(7-10-16)20-21(25)19(22(26)27)17-12-15(8-11-18(17)24-20)13-4-2-1-3-5-13/h1-12,25H,(H,26,27)
Reactome pathway
n/an/a 2.30E+5n/an/an/an/an/an/a
Wyeth Research
Curated by ChEMBL
Assay Description
Inhibition of human recombinant DHOD expressed in Escherichia coli
J Med Chem 50: 21-39 (2007)
Article DOI: 10.1021/jm0602256
BindingDB Entry DOI: 10.7270/Q2Z60PVV
P-selectin/P-selectin glycoprotein ligand 1
(Homo sapiens (Human))
BDBM50201922
(2-(4-chlorophenyl)-3-hydroxy-6-phenylquinoline-4-c...)
Show SMILES OC(=O)c1c(O)c(nc2ccc(cc12)-c1ccccc1)-c1ccc(Cl)cc1
Show InChI InChI=1S/C22H14ClNO3/c23-16-9-6-14(7-10-16)20-21(25)19(22(26)27)17-12-15(8-11-18(17)24-20)13-4-2-1-3-5-13/h1-12,25H,(H,26,27)
NCI pathway
Reactome pathway
n/an/a 3.75E+5n/an/an/an/an/an/a
Wyeth Research
Curated by ChEMBL
Assay Description
Inhibition of P-selectin-mediated adhesion of HL60 cells
J Med Chem 50: 21-39 (2007)
Article DOI: 10.1021/jm0602256
BindingDB Entry DOI: 10.7270/Q2Z60PVV