BDBM50201926 8-bromo-2-(4-chlorophenyl)-3-hydroxyquinoline-4-carboxylicacid::CHEMBL384039
SMILES: OC(=O)c1c(O)c(nc2c(Br)cccc12)-c1ccc(Cl)cc1
InChI Key: InChIKey=RWTZDUAHCXMERP-UHFFFAOYSA-N
Data: 2 IC50
Activity Spreadsheet -- Enzyme Inhibition Constant Data from BindingDB
Found 2 hits for monomerid = 50201926
Trg + Lig
Ki
nM
ΔG°
kcal/mole
IC50
nM
Kd
nM
EC50/IC50
nM
koff
s-1
kon
M-1s-1
pHTemp
°C
P-selectin/P-selectin glycoprotein ligand 1
(Homo sapiens (Human))
BDBM50201926
(8-bromo-2-(4-chlorophenyl)-3-hydroxyquinoline-4-ca...)
Show SMILES OC(=O)c1c(O)c(nc2c(Br)cccc12)-c1ccc(Cl)cc1
Show InChI InChI=1S/C16H9BrClNO3/c17-11-3-1-2-10-12(16(21)22)15(20)13(19-14(10)11)8-4-6-9(18)7-5-8/h1-7,20H,(H,21,22)
NCI pathway
Reactome pathway
n/an/a 6.25E+5n/an/an/an/an/an/a
Wyeth Research
Curated by ChEMBL
Assay Description
Inhibition of P-selectin-mediated adhesion of HL60 cells
J Med Chem 50: 21-39 (2007)
Article DOI: 10.1021/jm0602256
BindingDB Entry DOI: 10.7270/Q2Z60PVV
Dihydroorotate dehydrogenase
(Homo sapiens (Human))
BDBM50201926
(8-bromo-2-(4-chlorophenyl)-3-hydroxyquinoline-4-ca...)
Show SMILES OC(=O)c1c(O)c(nc2c(Br)cccc12)-c1ccc(Cl)cc1
Show InChI InChI=1S/C16H9BrClNO3/c17-11-3-1-2-10-12(16(21)22)15(20)13(19-14(10)11)8-4-6-9(18)7-5-8/h1-7,20H,(H,21,22)
Reactome pathway
n/an/a 1.32E+5n/an/an/an/an/an/a
Wyeth Research
Curated by ChEMBL
Assay Description
Inhibition of human recombinant DHOD expressed in Escherichia coli
J Med Chem 50: 21-39 (2007)
Article DOI: 10.1021/jm0602256
BindingDB Entry DOI: 10.7270/Q2Z60PVV