BDBM50202067 (3R,3aS,4S,4aR,7R,8aR,9aR)-decahydro-7-hydroxy-3-methyl-4-[(E)-2-[5-(2,3-dichlorophenyl)-2-pyridinyl]ethenyl]naphtho-[2,3-c]furan-1(3H)-one::CHEMBL374503
SMILES: C[C@H]1OC(=O)[C@@H]2C[C@@H]3C[C@H](O)CC[C@H]3[C@H](\C=C\c3ccc(cn3)-c3cccc(Cl)c3Cl)[C@H]12
InChI Key: InChIKey=CALHAOYKYUXRJO-DLZYVLAFSA-N
Data: 1 IC50
Activity Spreadsheet -- Enzyme Inhibition Constant Data from BindingDB
Found 1 hit for monomerid = 50202067
Trg + Lig
Ki
nM
ΔG°
kcal/mole
IC50
nM
Kd
nM
EC50/IC50
nM
koff
s-1
kon
M-1s-1
pHTemp
°C
Proteinase-activated receptor 1
(Homo sapiens (Human))
BDBM50202067
((3R,3aS,4S,4aR,7R,8aR,9aR)-decahydro-7-hydroxy-3-m...)
Show SMILES C[C@H]1OC(=O)[C@@H]2C[C@@H]3C[C@H](O)CC[C@H]3[C@H](\C=C\c3ccc(cn3)-c3cccc(Cl)c3Cl)[C@H]12 |r|
Show InChI InChI=1S/C26H27Cl2NO3/c1-14-24-21(19-10-8-18(30)11-16(19)12-22(24)26(31)32-14)9-7-17-6-5-15(13-29-17)20-3-2-4-23(27)25(20)28/h2-7,9,13-14,16,18-19,21-22,24,30H,8,10-12H2,1H3/b9-7+/t14-,16+,18-,19-,21+,22-,24+/m1/s1
n/an/a 16.5n/an/an/an/an/an/a
Schering-Plough Research Institute
Curated by ChEMBL
Assay Description
Displacement of [3H]haTRAP from PAR1 in human platelet membrane
J Med Chem 50: 129-38 (2007)
Article DOI: 10.1021/jm061043e
BindingDB Entry DOI: 10.7270/Q22V2FS9