BDBM50202106 CHEMBL218758::E-(2S)-(3R-fluoro-pyrrolidin-1-yl)-N-(5-hydroxy-adamantan-2-yl)-propionamide
SMILES:
InChI Key: InChIKey=ZFNDDTOHDPHZON-IXXSQMGDSA-N
Data: 2 KI  3 IC50
Activity Spreadsheet -- Enzyme Inhibition Constant Data from BindingDB
Found 5 hits for monomerid = 50202106
Trg + Lig
Ki
nM
ΔG°
kcal/mole
IC50
nM
Kd
nM
EC50/IC50
nM
koff
s-1
kon
M-1s-1
pHTemp
°C
11-beta-hydroxysteroid dehydrogenase 1
(Homo sapiens (Human))
BDBM50202106
(CHEMBL218758 | E-(2S)-(3R-fluoro-pyrrolidin-1-yl)-...)
Show InChI InChI=1S/C17H27FN2O2/c1-10(20-3-2-14(18)9-20)16(21)19-15-12-4-11-5-13(15)8-17(22,6-11)7-12/h10-15,22H,2-9H2,1H3,(H,19,21)/t10-,11?,12?,13?,14+,15-,17-/m0/s1
Reactome pathway
21n/an/an/an/an/an/an/an/a
Abbott Laboratories
Curated by ChEMBL
Assay Description
Inhibition of human 11beta-HSD1 expressed in E. coli by SPA
J Med Chem 50: 149-64 (2007)
Article DOI: 10.1021/jm0609364
BindingDB Entry DOI: 10.7270/Q2Z60NQN
11-beta-hydroxysteroid dehydrogenase 1
(Mus musculus (mouse))
BDBM50202106
(CHEMBL218758 | E-(2S)-(3R-fluoro-pyrrolidin-1-yl)-...)
Show InChI InChI=1S/C17H27FN2O2/c1-10(20-3-2-14(18)9-20)16(21)19-15-12-4-11-5-13(15)8-17(22,6-11)7-12/h10-15,22H,2-9H2,1H3,(H,19,21)/t10-,11?,12?,13?,14+,15-,17-/m0/s1
Reactome pathway
24n/an/an/an/an/an/an/an/a
Abbott Laboratories
Curated by ChEMBL
Assay Description
Inhibition of mouse 11beta-HSD1 expressed in E. coli by SPA
J Med Chem 50: 149-64 (2007)
Article DOI: 10.1021/jm0609364
BindingDB Entry DOI: 10.7270/Q2Z60NQN
11-beta-hydroxysteroid dehydrogenase 1
(Homo sapiens (Human))
BDBM50202106
(CHEMBL218758 | E-(2S)-(3R-fluoro-pyrrolidin-1-yl)-...)
Show InChI InChI=1S/C17H27FN2O2/c1-10(20-3-2-14(18)9-20)16(21)19-15-12-4-11-5-13(15)8-17(22,6-11)7-12/h10-15,22H,2-9H2,1H3,(H,19,21)/t10-,11?,12?,13?,14+,15-,17-/m0/s1
Reactome pathway
n/an/a 450n/an/an/an/an/an/a
Abbott Laboratories
Curated by ChEMBL
Assay Description
Inhibition of human 11beta-HSD1 expressed in HEK293 cells by FPIA
J Med Chem 50: 149-64 (2007)
Article DOI: 10.1021/jm0609364
BindingDB Entry DOI: 10.7270/Q2Z60NQN
11-beta-Hydroxysteroid Dehydrogenase 2 (11-beta-HSD2)
(Mus musculus (mouse))
BDBM50202106
(CHEMBL218758 | E-(2S)-(3R-fluoro-pyrrolidin-1-yl)-...)
Show InChI InChI=1S/C17H27FN2O2/c1-10(20-3-2-14(18)9-20)16(21)19-15-12-4-11-5-13(15)8-17(22,6-11)7-12/h10-15,22H,2-9H2,1H3,(H,19,21)/t10-,11?,12?,13?,14+,15-,17-/m0/s1
n/an/a>1.00E+5n/an/an/an/an/an/a
Abbott Laboratories
Curated by ChEMBL
Assay Description
Inhibitory activity against mouse 11beta-HSD2 by SPA
J Med Chem 50: 149-64 (2007)
Article DOI: 10.1021/jm0609364
BindingDB Entry DOI: 10.7270/Q2Z60NQN
11-beta-hydroxysteroid dehydrogenase 2
(Homo sapiens (Human))
BDBM50202106
(CHEMBL218758 | E-(2S)-(3R-fluoro-pyrrolidin-1-yl)-...)
Show InChI InChI=1S/C17H27FN2O2/c1-10(20-3-2-14(18)9-20)16(21)19-15-12-4-11-5-13(15)8-17(22,6-11)7-12/h10-15,22H,2-9H2,1H3,(H,19,21)/t10-,11?,12?,13?,14+,15-,17-/m0/s1
n/an/a>1.00E+5n/an/an/an/an/an/a
Abbott Laboratories
Curated by ChEMBL
Assay Description
Inhibitory activity against human 11beta-HSD2 by SPA
J Med Chem 50: 149-64 (2007)
Article DOI: 10.1021/jm0609364
BindingDB Entry DOI: 10.7270/Q2Z60NQN