BDBM50202388 (RR/SS)-2-[1-(4-chlorophenyl)pentyl]piperidine::(RS/SR)-2-[1-(4-chlorophenyl)pentyl]piperidine::CHEMBL218849
SMILES: CCCCC(C1CCCCN1)c1ccc(Cl)cc1
InChI Key: InChIKey=ZYPXTTXHMBCKFT-UHFFFAOYSA-N
Data: 6 KI  6 IC50
Activity Spreadsheet -- Enzyme Inhibition Constant Data from BindingDB
Found 12 hits for monomerid = 50202388
Trg + Lig
Ki
nM
ΔG°
kcal/mole
IC50
nM
Kd
nM
EC50/IC50
nM
koff
s-1
kon
M-1s-1
pHTemp
°C
Sodium-dependent dopamine transporter
(Homo sapiens (Human))
BDBM50202388
((RR/SS)-2-[1-(4-chlorophenyl)pentyl]piperidine | (...)
Show SMILES CCCCC(C1CCCCN1)c1ccc(Cl)cc1
Show InChI InChI=1S/C16H24ClN/c1-2-3-6-15(16-7-4-5-12-18-16)13-8-10-14(17)11-9-13/h8-11,15-16,18H,2-7,12H2,1H3
NCI pathway
Reactome pathway
7.80n/an/an/an/an/an/an/an/a
Massachusetts College of Pharmacy and Health Sciences
Curated by ChEMBL
Assay Description
Displacement of [125I]RTI-55 from human DAT expressing HEK293 cells
J Med Chem 50: 219-32 (2007)
Article DOI: 10.1021/jm0608614
BindingDB Entry DOI: 10.7270/Q2PN96F3
Sodium-dependent noradrenaline transporter
(Homo sapiens (Human))
BDBM50202388
((RR/SS)-2-[1-(4-chlorophenyl)pentyl]piperidine | (...)
Show SMILES CCCCC(C1CCCCN1)c1ccc(Cl)cc1
Show InChI InChI=1S/C16H24ClN/c1-2-3-6-15(16-7-4-5-12-18-16)13-8-10-14(17)11-9-13/h8-11,15-16,18H,2-7,12H2,1H3
Reactome pathway
230n/an/an/an/an/an/an/an/a
Massachusetts College of Pharmacy and Health Sciences
Curated by ChEMBL
Assay Description
Displacement of [125I]RTI-55 from human NET expressing HEK293 cells
J Med Chem 50: 219-32 (2007)
Article DOI: 10.1021/jm0608614
BindingDB Entry DOI: 10.7270/Q2PN96F3
Sodium-dependent dopamine transporter
(Homo sapiens (Human))
BDBM50202388
((RR/SS)-2-[1-(4-chlorophenyl)pentyl]piperidine | (...)
Show SMILES CCCCC(C1CCCCN1)c1ccc(Cl)cc1
Show InChI InChI=1S/C16H24ClN/c1-2-3-6-15(16-7-4-5-12-18-16)13-8-10-14(17)11-9-13/h8-11,15-16,18H,2-7,12H2,1H3
NCI pathway
Reactome pathway
290n/an/an/an/an/an/an/an/a
Massachusetts College of Pharmacy and Health Sciences
Curated by ChEMBL
Assay Description
Displacement of [125I]RTI-55 from human DAT expressing HEK293 cells
J Med Chem 50: 219-32 (2007)
Article DOI: 10.1021/jm0608614
BindingDB Entry DOI: 10.7270/Q2PN96F3
Sodium-dependent noradrenaline transporter
(Homo sapiens (Human))
BDBM50202388
((RR/SS)-2-[1-(4-chlorophenyl)pentyl]piperidine | (...)
Show SMILES CCCCC(C1CCCCN1)c1ccc(Cl)cc1
Show InChI InChI=1S/C16H24ClN/c1-2-3-6-15(16-7-4-5-12-18-16)13-8-10-14(17)11-9-13/h8-11,15-16,18H,2-7,12H2,1H3
Reactome pathway
1.60E+3n/an/an/an/an/an/an/an/a
Massachusetts College of Pharmacy and Health Sciences
Curated by ChEMBL
Assay Description
Displacement of [125I]RTI-55 from human NET expressing HEK293 cells
J Med Chem 50: 219-32 (2007)
Article DOI: 10.1021/jm0608614
BindingDB Entry DOI: 10.7270/Q2PN96F3
Sodium-dependent serotonin transporter
(Homo sapiens (Human))
BDBM50202388
((RR/SS)-2-[1-(4-chlorophenyl)pentyl]piperidine | (...)
Show SMILES CCCCC(C1CCCCN1)c1ccc(Cl)cc1
Show InChI InChI=1S/C16H24ClN/c1-2-3-6-15(16-7-4-5-12-18-16)13-8-10-14(17)11-9-13/h8-11,15-16,18H,2-7,12H2,1H3
4.30E+3n/an/an/an/an/an/an/an/a
Massachusetts College of Pharmacy and Health Sciences
Curated by ChEMBL
Assay Description
Displacement of [125I]RTI-55 from human SERT expressing HEK293 cells
J Med Chem 50: 219-32 (2007)
Article DOI: 10.1021/jm0608614
BindingDB Entry DOI: 10.7270/Q2PN96F3
Sodium-dependent serotonin transporter
(Homo sapiens (Human))
BDBM50202388
((RR/SS)-2-[1-(4-chlorophenyl)pentyl]piperidine | (...)
Show SMILES CCCCC(C1CCCCN1)c1ccc(Cl)cc1
Show InChI InChI=1S/C16H24ClN/c1-2-3-6-15(16-7-4-5-12-18-16)13-8-10-14(17)11-9-13/h8-11,15-16,18H,2-7,12H2,1H3
4.80E+3n/an/an/an/an/an/an/an/a
Massachusetts College of Pharmacy and Health Sciences
Curated by ChEMBL
Assay Description
Displacement of [125I]RTI-55 from human SERT expressing HEK293 cells
J Med Chem 50: 219-32 (2007)
Article DOI: 10.1021/jm0608614
BindingDB Entry DOI: 10.7270/Q2PN96F3
Sodium-dependent dopamine transporter
(Homo sapiens (Human))
BDBM50202388
((RR/SS)-2-[1-(4-chlorophenyl)pentyl]piperidine | (...)
Show SMILES CCCCC(C1CCCCN1)c1ccc(Cl)cc1
Show InChI InChI=1S/C16H24ClN/c1-2-3-6-15(16-7-4-5-12-18-16)13-8-10-14(17)11-9-13/h8-11,15-16,18H,2-7,12H2,1H3
NCI pathway
Reactome pathway
n/an/a 170n/an/an/an/an/an/a
Massachusetts College of Pharmacy and Health Sciences
Curated by ChEMBL
Assay Description
Inhibition of [3H]DA uptake at human DAT expressing HEK293 cells
J Med Chem 50: 219-32 (2007)
Article DOI: 10.1021/jm0608614
BindingDB Entry DOI: 10.7270/Q2PN96F3
Sodium-dependent serotonin transporter
(Homo sapiens (Human))
BDBM50202388
((RR/SS)-2-[1-(4-chlorophenyl)pentyl]piperidine | (...)
Show SMILES CCCCC(C1CCCCN1)c1ccc(Cl)cc1
Show InChI InChI=1S/C16H24ClN/c1-2-3-6-15(16-7-4-5-12-18-16)13-8-10-14(17)11-9-13/h8-11,15-16,18H,2-7,12H2,1H3
n/an/a 4.00E+3n/an/an/an/an/an/a
Massachusetts College of Pharmacy and Health Sciences
Curated by ChEMBL
Assay Description
Inhibition of [3H]5-HT uptake into human SERT expressing HEK293 cells
J Med Chem 50: 219-32 (2007)
Article DOI: 10.1021/jm0608614
BindingDB Entry DOI: 10.7270/Q2PN96F3
Sodium-dependent serotonin transporter
(Homo sapiens (Human))
BDBM50202388
((RR/SS)-2-[1-(4-chlorophenyl)pentyl]piperidine | (...)
Show SMILES CCCCC(C1CCCCN1)c1ccc(Cl)cc1
Show InChI InChI=1S/C16H24ClN/c1-2-3-6-15(16-7-4-5-12-18-16)13-8-10-14(17)11-9-13/h8-11,15-16,18H,2-7,12H2,1H3
n/an/a 3.30E+3n/an/an/an/an/an/a
Massachusetts College of Pharmacy and Health Sciences
Curated by ChEMBL
Assay Description
Inhibition of [3H]5-HT uptake into human SERT expressing HEK293 cells
J Med Chem 50: 219-32 (2007)
Article DOI: 10.1021/jm0608614
BindingDB Entry DOI: 10.7270/Q2PN96F3
Sodium-dependent noradrenaline transporter
(Homo sapiens (Human))
BDBM50202388
((RR/SS)-2-[1-(4-chlorophenyl)pentyl]piperidine | (...)
Show SMILES CCCCC(C1CCCCN1)c1ccc(Cl)cc1
Show InChI InChI=1S/C16H24ClN/c1-2-3-6-15(16-7-4-5-12-18-16)13-8-10-14(17)11-9-13/h8-11,15-16,18H,2-7,12H2,1H3
Reactome pathway
n/an/a 26n/an/an/an/an/an/a
Massachusetts College of Pharmacy and Health Sciences
Curated by ChEMBL
Assay Description
Inhibition of [3H]NE uptake into human NET expressing HEK293 cells
J Med Chem 50: 219-32 (2007)
Article DOI: 10.1021/jm0608614
BindingDB Entry DOI: 10.7270/Q2PN96F3
Sodium-dependent noradrenaline transporter
(Homo sapiens (Human))
BDBM50202388
((RR/SS)-2-[1-(4-chlorophenyl)pentyl]piperidine | (...)
Show SMILES CCCCC(C1CCCCN1)c1ccc(Cl)cc1
Show InChI InChI=1S/C16H24ClN/c1-2-3-6-15(16-7-4-5-12-18-16)13-8-10-14(17)11-9-13/h8-11,15-16,18H,2-7,12H2,1H3
Reactome pathway
n/an/a 180n/an/an/an/an/an/a
Massachusetts College of Pharmacy and Health Sciences
Curated by ChEMBL
Assay Description
Inhibition of [3H]NE uptake into human NET expressing HEK293 cells
J Med Chem 50: 219-32 (2007)
Article DOI: 10.1021/jm0608614
BindingDB Entry DOI: 10.7270/Q2PN96F3
Sodium-dependent dopamine transporter
(Homo sapiens (Human))
BDBM50202388
((RR/SS)-2-[1-(4-chlorophenyl)pentyl]piperidine | (...)
Show SMILES CCCCC(C1CCCCN1)c1ccc(Cl)cc1
Show InChI InChI=1S/C16H24ClN/c1-2-3-6-15(16-7-4-5-12-18-16)13-8-10-14(17)11-9-13/h8-11,15-16,18H,2-7,12H2,1H3
NCI pathway
Reactome pathway
n/an/a 8.20n/an/an/an/an/an/a
Massachusetts College of Pharmacy and Health Sciences
Curated by ChEMBL
Assay Description
Inhibition of [3H]DA uptake at human DAT expressing HEK293 cells
J Med Chem 50: 219-32 (2007)
Article DOI: 10.1021/jm0608614
BindingDB Entry DOI: 10.7270/Q2PN96F3