BDBM50202405 (RR/SS)-2-[1-(3,4-dichlorophenyl)-3-methylbutyl]-1-methylpiperidine::(RS/SR)-2-[1-(3,4-dichlorophenyl)-3-methylbutyl]-1-methylpiperidine::CHEMBL387117
SMILES: CC(C)CC(C1CCCCN1C)c1ccc(Cl)c(Cl)c1
InChI Key: InChIKey=FRKGVKAPAMAQSO-UHFFFAOYSA-N
Data: 6 KI  6 IC50
Activity Spreadsheet -- Enzyme Inhibition Constant Data from BindingDB
Found 12 hits for monomerid = 50202405
Trg + Lig
Ki
nM
ΔG°
kcal/mole
IC50
nM
Kd
nM
EC50/IC50
nM
koff
s-1
kon
M-1s-1
pHTemp
°C
Sodium-dependent dopamine transporter
(Homo sapiens (Human))
BDBM50202405
((RR/SS)-2-[1-(3,4-dichlorophenyl)-3-methylbutyl]-1...)
Show SMILES CC(C)CC(C1CCCCN1C)c1ccc(Cl)c(Cl)c1
Show InChI InChI=1S/C17H25Cl2N/c1-12(2)10-14(17-6-4-5-9-20(17)3)13-7-8-15(18)16(19)11-13/h7-8,11-12,14,17H,4-6,9-10H2,1-3H3
NCI pathway
Reactome pathway
6.60n/an/an/an/an/an/an/an/a
Massachusetts College of Pharmacy and Health Sciences
Curated by ChEMBL
Assay Description
Displacement of [125I]RTI-55 from human DAT expressing HEK293 cells
J Med Chem 50: 219-32 (2007)
Article DOI: 10.1021/jm0608614
BindingDB Entry DOI: 10.7270/Q2PN96F3
Sodium-dependent dopamine transporter
(Homo sapiens (Human))
BDBM50202405
((RR/SS)-2-[1-(3,4-dichlorophenyl)-3-methylbutyl]-1...)
Show SMILES CC(C)CC(C1CCCCN1C)c1ccc(Cl)c(Cl)c1
Show InChI InChI=1S/C17H25Cl2N/c1-12(2)10-14(17-6-4-5-9-20(17)3)13-7-8-15(18)16(19)11-13/h7-8,11-12,14,17H,4-6,9-10H2,1-3H3
NCI pathway
Reactome pathway
44n/an/an/an/an/an/an/an/a
Massachusetts College of Pharmacy and Health Sciences
Curated by ChEMBL
Assay Description
Displacement of [125I]RTI-55 from human DAT expressing HEK293 cells
J Med Chem 50: 219-32 (2007)
Article DOI: 10.1021/jm0608614
BindingDB Entry DOI: 10.7270/Q2PN96F3
Sodium-dependent noradrenaline transporter
(Homo sapiens (Human))
BDBM50202405
((RR/SS)-2-[1-(3,4-dichlorophenyl)-3-methylbutyl]-1...)
Show SMILES CC(C)CC(C1CCCCN1C)c1ccc(Cl)c(Cl)c1
Show InChI InChI=1S/C17H25Cl2N/c1-12(2)10-14(17-6-4-5-9-20(17)3)13-7-8-15(18)16(19)11-13/h7-8,11-12,14,17H,4-6,9-10H2,1-3H3
Reactome pathway
190n/an/an/an/an/an/an/an/a
Massachusetts College of Pharmacy and Health Sciences
Curated by ChEMBL
Assay Description
Displacement of [125I]RTI-55 from human NET expressing HEK293 cells
J Med Chem 50: 219-32 (2007)
Article DOI: 10.1021/jm0608614
BindingDB Entry DOI: 10.7270/Q2PN96F3
Sodium-dependent noradrenaline transporter
(Homo sapiens (Human))
BDBM50202405
((RR/SS)-2-[1-(3,4-dichlorophenyl)-3-methylbutyl]-1...)
Show SMILES CC(C)CC(C1CCCCN1C)c1ccc(Cl)c(Cl)c1
Show InChI InChI=1S/C17H25Cl2N/c1-12(2)10-14(17-6-4-5-9-20(17)3)13-7-8-15(18)16(19)11-13/h7-8,11-12,14,17H,4-6,9-10H2,1-3H3
Reactome pathway
660n/an/an/an/an/an/an/an/a
Massachusetts College of Pharmacy and Health Sciences
Curated by ChEMBL
Assay Description
Displacement of [125I]RTI-55 from human NET expressing HEK293 cells
J Med Chem 50: 219-32 (2007)
Article DOI: 10.1021/jm0608614
BindingDB Entry DOI: 10.7270/Q2PN96F3
Sodium-dependent serotonin transporter
(Homo sapiens (Human))
BDBM50202405
((RR/SS)-2-[1-(3,4-dichlorophenyl)-3-methylbutyl]-1...)
Show SMILES CC(C)CC(C1CCCCN1C)c1ccc(Cl)c(Cl)c1
Show InChI InChI=1S/C17H25Cl2N/c1-12(2)10-14(17-6-4-5-9-20(17)3)13-7-8-15(18)16(19)11-13/h7-8,11-12,14,17H,4-6,9-10H2,1-3H3
1.30E+3n/an/an/an/an/an/an/an/a
Massachusetts College of Pharmacy and Health Sciences
Curated by ChEMBL
Assay Description
Displacement of [125I]RTI-55 from human SERT expressing HEK293 cells
J Med Chem 50: 219-32 (2007)
Article DOI: 10.1021/jm0608614
BindingDB Entry DOI: 10.7270/Q2PN96F3
Sodium-dependent serotonin transporter
(Homo sapiens (Human))
BDBM50202405
((RR/SS)-2-[1-(3,4-dichlorophenyl)-3-methylbutyl]-1...)
Show SMILES CC(C)CC(C1CCCCN1C)c1ccc(Cl)c(Cl)c1
Show InChI InChI=1S/C17H25Cl2N/c1-12(2)10-14(17-6-4-5-9-20(17)3)13-7-8-15(18)16(19)11-13/h7-8,11-12,14,17H,4-6,9-10H2,1-3H3
1.50E+3n/an/an/an/an/an/an/an/a
Massachusetts College of Pharmacy and Health Sciences
Curated by ChEMBL
Assay Description
Displacement of [125I]RTI-55 from human SERT expressing HEK293 cells
J Med Chem 50: 219-32 (2007)
Article DOI: 10.1021/jm0608614
BindingDB Entry DOI: 10.7270/Q2PN96F3
Sodium-dependent dopamine transporter
(Homo sapiens (Human))
BDBM50202405
((RR/SS)-2-[1-(3,4-dichlorophenyl)-3-methylbutyl]-1...)
Show SMILES CC(C)CC(C1CCCCN1C)c1ccc(Cl)c(Cl)c1
Show InChI InChI=1S/C17H25Cl2N/c1-12(2)10-14(17-6-4-5-9-20(17)3)13-7-8-15(18)16(19)11-13/h7-8,11-12,14,17H,4-6,9-10H2,1-3H3
NCI pathway
Reactome pathway
n/an/a 13n/an/an/an/an/an/a
Massachusetts College of Pharmacy and Health Sciences
Curated by ChEMBL
Assay Description
Inhibition of [3H]DA uptake at human DAT expressing HEK293 cells
J Med Chem 50: 219-32 (2007)
Article DOI: 10.1021/jm0608614
BindingDB Entry DOI: 10.7270/Q2PN96F3
Sodium-dependent dopamine transporter
(Homo sapiens (Human))
BDBM50202405
((RR/SS)-2-[1-(3,4-dichlorophenyl)-3-methylbutyl]-1...)
Show SMILES CC(C)CC(C1CCCCN1C)c1ccc(Cl)c(Cl)c1
Show InChI InChI=1S/C17H25Cl2N/c1-12(2)10-14(17-6-4-5-9-20(17)3)13-7-8-15(18)16(19)11-13/h7-8,11-12,14,17H,4-6,9-10H2,1-3H3
NCI pathway
Reactome pathway
n/an/a 45n/an/an/an/an/an/a
Massachusetts College of Pharmacy and Health Sciences
Curated by ChEMBL
Assay Description
Inhibition of [3H]DA uptake at human DAT expressing HEK293 cells
J Med Chem 50: 219-32 (2007)
Article DOI: 10.1021/jm0608614
BindingDB Entry DOI: 10.7270/Q2PN96F3
Sodium-dependent noradrenaline transporter
(Homo sapiens (Human))
BDBM50202405
((RR/SS)-2-[1-(3,4-dichlorophenyl)-3-methylbutyl]-1...)
Show SMILES CC(C)CC(C1CCCCN1C)c1ccc(Cl)c(Cl)c1
Show InChI InChI=1S/C17H25Cl2N/c1-12(2)10-14(17-6-4-5-9-20(17)3)13-7-8-15(18)16(19)11-13/h7-8,11-12,14,17H,4-6,9-10H2,1-3H3
Reactome pathway
n/an/a 28n/an/an/an/an/an/a
Massachusetts College of Pharmacy and Health Sciences
Curated by ChEMBL
Assay Description
Inhibition of [3H]NE uptake into human NET expressing HEK293 cells
J Med Chem 50: 219-32 (2007)
Article DOI: 10.1021/jm0608614
BindingDB Entry DOI: 10.7270/Q2PN96F3
Sodium-dependent noradrenaline transporter
(Homo sapiens (Human))
BDBM50202405
((RR/SS)-2-[1-(3,4-dichlorophenyl)-3-methylbutyl]-1...)
Show SMILES CC(C)CC(C1CCCCN1C)c1ccc(Cl)c(Cl)c1
Show InChI InChI=1S/C17H25Cl2N/c1-12(2)10-14(17-6-4-5-9-20(17)3)13-7-8-15(18)16(19)11-13/h7-8,11-12,14,17H,4-6,9-10H2,1-3H3
Reactome pathway
n/an/a 100n/an/an/an/an/an/a
Massachusetts College of Pharmacy and Health Sciences
Curated by ChEMBL
Assay Description
Inhibition of [3H]NE uptake into human NET expressing HEK293 cells
J Med Chem 50: 219-32 (2007)
Article DOI: 10.1021/jm0608614
BindingDB Entry DOI: 10.7270/Q2PN96F3
Sodium-dependent serotonin transporter
(Homo sapiens (Human))
BDBM50202405
((RR/SS)-2-[1-(3,4-dichlorophenyl)-3-methylbutyl]-1...)
Show SMILES CC(C)CC(C1CCCCN1C)c1ccc(Cl)c(Cl)c1
Show InChI InChI=1S/C17H25Cl2N/c1-12(2)10-14(17-6-4-5-9-20(17)3)13-7-8-15(18)16(19)11-13/h7-8,11-12,14,17H,4-6,9-10H2,1-3H3
n/an/a 2.40E+3n/an/an/an/an/an/a
Massachusetts College of Pharmacy and Health Sciences
Curated by ChEMBL
Assay Description
Inhibition of [3H]5-HT uptake into human SERT expressing HEK293 cells
J Med Chem 50: 219-32 (2007)
Article DOI: 10.1021/jm0608614
BindingDB Entry DOI: 10.7270/Q2PN96F3
Sodium-dependent serotonin transporter
(Homo sapiens (Human))
BDBM50202405
((RR/SS)-2-[1-(3,4-dichlorophenyl)-3-methylbutyl]-1...)
Show SMILES CC(C)CC(C1CCCCN1C)c1ccc(Cl)c(Cl)c1
Show InChI InChI=1S/C17H25Cl2N/c1-12(2)10-14(17-6-4-5-9-20(17)3)13-7-8-15(18)16(19)11-13/h7-8,11-12,14,17H,4-6,9-10H2,1-3H3
n/an/a 1.40E+3n/an/an/an/an/an/a
Massachusetts College of Pharmacy and Health Sciences
Curated by ChEMBL
Assay Description
Inhibition of [3H]5-HT uptake into human SERT expressing HEK293 cells
J Med Chem 50: 219-32 (2007)
Article DOI: 10.1021/jm0608614
BindingDB Entry DOI: 10.7270/Q2PN96F3