BDBM50203114 CHEMBL3936937
SMILES: CCn1ncc2cc3NC(=O)N[C@H](COCCNc(n3)c12)c1ccccc1
InChI Key: InChIKey=JVTHXSIRYSQHTL-OAHLLOKOSA-N
Data: 1 IC50
Activity Spreadsheet -- Enzyme Inhibition Constant Data from BindingDB
Found 1 hit for monomerid = 50203114
Trg + Lig
Ki
nM
ΔG°
kcal/mole
IC50
nM
Kd
nM
EC50/IC50
nM
koff
s-1
kon
M-1s-1
pHTemp
°C
Mitogen-activated protein kinase 1
(Homo sapiens (Human))
BDBM50203114
(CHEMBL3936937)
Show SMILES CCn1ncc2cc3NC(=O)N[C@H](COCCNc(n3)c12)c1ccccc1 |r|
Show InChI InChI=1S/C19H22N6O2/c1-2-25-17-14(11-21-25)10-16-23-18(17)20-8-9-27-12-15(22-19(26)24-16)13-6-4-3-5-7-13/h3-7,10-11,15H,2,8-9,12H2,1H3,(H3,20,22,23,24,26)/t15-/m1/s1
NCI pathway
Reactome pathway
n/an/a 5n/an/an/an/an/an/a
Dart Neuroscience LLC
Curated by ChEMBL
Assay Description
Inhibition of human activated ERK2 assessed as reduction in phosphorylation activity preincubated for 15 mins followed by addition of IMAP peptide as...
ACS Med Chem Lett 7: 1020-1021 (2016)
Article DOI: 10.1021/acsmedchemlett.6b00434
BindingDB Entry DOI: 10.7270/Q26Q207M