BDBM50203336 CHEMBL3894912
SMILES: CC(C)S(=O)(=O)N1CCN(CC1)c1ccc(OC[C@@H]2CO[C@](Cn3ccnc3)(O2)c2ccc(Cl)cc2Cl)cc1
InChI Key: InChIKey=MVZWJEJFJUUOER-SHQCIBLASA-N
Data: 5 IC50
Activity Spreadsheet -- Enzyme Inhibition Constant Data from BindingDB
Found 5 hits for monomerid = 50203336
Trg + Lig
Ki
nM
ΔG°
kcal/mole
IC50
nM
Kd
nM
EC50/IC50
nM
koff
s-1
kon
M-1s-1
pHTemp
°C
Cytochrome P450 21
(Homo sapiens (Human))
BDBM50203336
(CHEMBL3894912)
Show SMILES CC(C)S(=O)(=O)N1CCN(CC1)c1ccc(OC[C@@H]2CO[C@](Cn3ccnc3)(O2)c2ccc(Cl)cc2Cl)cc1 |r|
Show InChI InChI=1S/C27H32Cl2N4O5S/c1-20(2)39(34,35)33-13-11-32(12-14-33)22-4-6-23(7-5-22)36-16-24-17-37-27(38-24,18-31-10-9-30-19-31)25-8-3-21(28)15-26(25)29/h3-10,15,19-20,24H,11-14,16-18H2,1-2H3/t24-,27-/m1/s1
Reactome pathway
n/an/a 51n/an/an/an/an/an/a
Temple University School of Pharmacy
Curated by ChEMBL
Assay Description
Inhibition of recombinant CYP21 (unknown origin) overexpressed in human AD293 cells assessed as reduction in 11-deoxycortisol formation preincubated ...
Bioorg Med Chem Lett 26: 5825-5829 (2016)
Article DOI: 10.1016/j.bmcl.2016.10.016
BindingDB Entry DOI: 10.7270/Q2X63PW4
Cytochrome P450 17A1
(Homo sapiens (Human))
BDBM50203336
(CHEMBL3894912)
Show SMILES CC(C)S(=O)(=O)N1CCN(CC1)c1ccc(OC[C@@H]2CO[C@](Cn3ccnc3)(O2)c2ccc(Cl)cc2Cl)cc1 |r|
Show InChI InChI=1S/C27H32Cl2N4O5S/c1-20(2)39(34,35)33-13-11-32(12-14-33)22-4-6-23(7-5-22)36-16-24-17-37-27(38-24,18-31-10-9-30-19-31)25-8-3-21(28)15-26(25)29/h3-10,15,19-20,24H,11-14,16-18H2,1-2H3/t24-,27-/m1/s1
Reactome pathway
n/an/a 12n/an/an/an/an/an/a
Temple University School of Pharmacy
Curated by ChEMBL
Assay Description
Inhibition of recombinant CYP17 (unknown origin) overexpressed in human AD293 cells using [21-3H]17alpha-hydroxyl-pregenolone as substrate preincubat...
Bioorg Med Chem Lett 26: 5825-5829 (2016)
Article DOI: 10.1016/j.bmcl.2016.10.016
BindingDB Entry DOI: 10.7270/Q2X63PW4
Cytochrome P450 11B1, mitochondrial
(Homo sapiens (Human))
BDBM50203336
(CHEMBL3894912)
Show SMILES CC(C)S(=O)(=O)N1CCN(CC1)c1ccc(OC[C@@H]2CO[C@](Cn3ccnc3)(O2)c2ccc(Cl)cc2Cl)cc1 |r|
Show InChI InChI=1S/C27H32Cl2N4O5S/c1-20(2)39(34,35)33-13-11-32(12-14-33)22-4-6-23(7-5-22)36-16-24-17-37-27(38-24,18-31-10-9-30-19-31)25-8-3-21(28)15-26(25)29/h3-10,15,19-20,24H,11-14,16-18H2,1-2H3/t24-,27-/m1/s1
n/an/a 40n/an/an/an/an/an/a
Temple University School of Pharmacy
Curated by ChEMBL
Assay Description
Inhibition of recombinant CYP11B1 (unknown origin) overexpressed in human AD293 cells assessed as reduction in cortisol formation preincubated for 60...
Bioorg Med Chem Lett 26: 5825-5829 (2016)
Article DOI: 10.1016/j.bmcl.2016.10.016
BindingDB Entry DOI: 10.7270/Q2X63PW4
Cytochrome P450 3A4
(Homo sapiens (Human))
BDBM50203336
(CHEMBL3894912)
Show SMILES CC(C)S(=O)(=O)N1CCN(CC1)c1ccc(OC[C@@H]2CO[C@](Cn3ccnc3)(O2)c2ccc(Cl)cc2Cl)cc1 |r|
Show InChI InChI=1S/C27H32Cl2N4O5S/c1-20(2)39(34,35)33-13-11-32(12-14-33)22-4-6-23(7-5-22)36-16-24-17-37-27(38-24,18-31-10-9-30-19-31)25-8-3-21(28)15-26(25)29/h3-10,15,19-20,24H,11-14,16-18H2,1-2H3/t24-,27-/m1/s1
Reactome pathway
n/an/a 198n/an/an/an/an/an/a
Temple University School of Pharmacy
Curated by ChEMBL
Assay Description
Inhibition of human Cyp3A4 using testosterone as substrate by LC-MS/MS analysis
Bioorg Med Chem Lett 26: 5825-5829 (2016)
Article DOI: 10.1016/j.bmcl.2016.10.016
BindingDB Entry DOI: 10.7270/Q2X63PW4
Cytochrome P450 19A1
(Homo sapiens (Human))
BDBM50203336
(CHEMBL3894912)
Show SMILES CC(C)S(=O)(=O)N1CCN(CC1)c1ccc(OC[C@@H]2CO[C@](Cn3ccnc3)(O2)c2ccc(Cl)cc2Cl)cc1 |r|
Show InChI InChI=1S/C27H32Cl2N4O5S/c1-20(2)39(34,35)33-13-11-32(12-14-33)22-4-6-23(7-5-22)36-16-24-17-37-27(38-24,18-31-10-9-30-19-31)25-8-3-21(28)15-26(25)29/h3-10,15,19-20,24H,11-14,16-18H2,1-2H3/t24-,27-/m1/s1
Reactome pathway
n/an/a 1.20E+3n/an/an/an/an/an/a
Temple University School of Pharmacy
Curated by ChEMBL
Assay Description
Inhibition of Cyp19 (unknown origin)
Bioorg Med Chem Lett 26: 5825-5829 (2016)
Article DOI: 10.1016/j.bmcl.2016.10.016
BindingDB Entry DOI: 10.7270/Q2X63PW4