BDBM50203804 (2S)-2-{[(2S)-1-[(2S)-2-amino-4-methylpentanoyl]pyrrolidin-2-yl]formamido}-N-[(1S)-1-{[(1S)-1-{[(1S)-1-{[(1S)-1-{[(1S)-1-{[(1S)-1-[({[(1S)-1-{[(1S)-4-carbamimidamido-1-{[(1S)-4-carbamimidamido-1-carbamoylbutyl]carbamoyl}butyl]carbamoyl}-3-methylbutyl]carbamoyl}methyl)carbamoyl]-2-phenylethyl]carbamoyl}-2-hydroxyethyl]carbamoyl}-2-carbamoylethyl]carbamoyl}-2-(1H-indol-3-yl)ethyl]carbamoyl}-2-carbamoylethyl]carbamoyl}-2-(4-hydroxyphenyl)ethyl]butanediamide::CHEMBL426552
SMILES: CC(C)C[C@H](N)C(=O)N1CCC[C@H]1C(=O)N[C@@H](CC(N)=O)C(=O)N[C@@H](Cc1ccc(O)cc1)C(=O)N[C@@H](CC(N)=O)C(=O)N[C@@H](Cc1c[nH]c2ccccc12)C(=O)N[C@@H](CC(N)=O)C(=O)N[C@@H](CO)C(=O)N[C@@H](Cc1ccccc1)C(=O)NCC(=O)N[C@@H](CC(C)C)C(=O)N[C@@H](CCCN=C(N)N)C(=O)N[C@@H](CCCN=C(N)N)C(N)=O
InChI Key: InChIKey=ACYFXTRDZDRFKU-TZMVSQBHSA-N
Data: 1 KI  1 EC50
Activity Spreadsheet -- Enzyme Inhibition Constant Data from BindingDB
Found 2 hits for monomerid = 50203804
Trg + Lig
Ki
nM
ΔG°
kcal/mole
IC50
nM
Kd
nM
EC50/IC50
nM
koff
s-1
kon
M-1s-1
pHTemp
°C
G-protein Coupled Receptor 54
(Homo sapiens (Human))
BDBM50203804
((2S)-2-{[(2S)-1-[(2S)-2-amino-4-methylpentanoyl]py...)
Show SMILES CC(C)C[C@H](N)C(=O)N1CCC[C@H]1C(=O)N[C@@H](CC(N)=O)C(=O)N[C@@H](Cc1ccc(O)cc1)C(=O)N[C@@H](CC(N)=O)C(=O)N[C@@H](Cc1c[nH]c2ccccc12)C(=O)N[C@@H](CC(N)=O)C(=O)N[C@@H](CO)C(=O)N[C@@H](Cc1ccccc1)C(=O)NCC(=O)N[C@@H](CC(C)C)C(=O)N[C@@H](CCCN=C(N)N)C(=O)N[C@@H](CCCN=C(N)N)C(N)=O |wU:4.4,72.75,87.91,36.37,12.13,106.110,58.61,wD:66.69,24.24,95.99,16.16,44.45,(-20.28,-19.15,;-20.26,-20.69,;-21.58,-21.47,;-18.91,-21.43,;-18.9,-22.99,;-20.24,-23.76,;-17.57,-23.76,;-17.57,-25.3,;-16.25,-22.99,;-15.77,-21.53,;-14.22,-21.54,;-13.74,-22.99,;-14.99,-23.9,;-14.99,-25.44,;-16.34,-26.21,;-13.67,-26.22,;-13.67,-27.76,;-15,-28.52,;-15,-30.06,;-13.68,-30.84,;-16.33,-30.83,;-12.34,-28.53,;-12.34,-30.07,;-10.99,-27.76,;-9.66,-28.53,;-9.66,-30.07,;-8.33,-30.84,;-8.33,-32.38,;-7.01,-33.15,;-5.66,-32.38,;-4.33,-33.15,;-5.67,-30.83,;-6.99,-30.07,;-8.32,-27.76,;-8.32,-26.22,;-6.99,-28.53,;-5.66,-27.77,;-5.66,-26.23,;-4.32,-25.46,;-2.99,-26.23,;-4.32,-23.92,;-4.32,-28.54,;-4.33,-30.08,;-2.99,-27.77,;-1.65,-28.54,;-1.66,-30.08,;-.33,-30.85,;.93,-29.86,;2.16,-30.85,;1.68,-32.32,;2.44,-33.63,;1.68,-34.96,;.14,-34.96,;-.62,-33.63,;.15,-32.31,;-.32,-27.77,;-.32,-26.23,;1.01,-28.54,;2.35,-27.77,;2.35,-26.23,;3.68,-25.47,;5.02,-26.24,;3.68,-23.93,;3.67,-28.55,;3.67,-30.09,;5.01,-27.78,;6.34,-28.55,;6.34,-30.09,;7.68,-30.86,;7.68,-27.78,;7.68,-26.24,;9.01,-28.55,;10.34,-27.78,;10.35,-26.24,;11.68,-25.48,;13.01,-26.24,;14.35,-25.48,;14.35,-23.93,;13.01,-23.16,;11.68,-23.94,;11.68,-28.56,;11.68,-30.1,;13.01,-27.79,;14.35,-28.55,;15.68,-27.78,;15.68,-26.24,;17.01,-28.55,;18.35,-27.78,;18.35,-26.24,;19.68,-25.48,;19.68,-23.94,;21.02,-26.25,;19.68,-28.56,;19.68,-30.1,;21.02,-27.79,;22.35,-28.56,;22.35,-30.1,;23.68,-30.87,;23.68,-32.41,;25.01,-33.18,;25.01,-34.72,;26.34,-35.49,;23.68,-35.49,;23.69,-27.79,;23.69,-26.25,;25.02,-28.56,;26.35,-27.79,;26.35,-26.25,;27.69,-25.48,;27.68,-23.95,;26.34,-23.19,;26.33,-21.65,;25,-20.88,;27.66,-20.87,;27.69,-28.57,;29.02,-27.8,;27.68,-30.11,)|
Show InChI InChI=1S/C75H110N24O18/c1-38(2)27-45(76)73(117)99-26-12-19-57(99)72(116)97-55(34-60(79)104)69(113)93-51(30-41-20-22-43(101)23-21-41)66(110)95-53(32-58(77)102)68(112)94-52(31-42-35-87-46-16-9-8-15-44(42)46)67(111)96-54(33-59(78)103)70(114)98-56(37-100)71(115)92-50(29-40-13-6-5-7-14-40)63(107)88-36-61(105)89-49(28-39(3)4)65(109)91-48(18-11-25-86-75(83)84)64(108)90-47(62(80)106)17-10-24-85-74(81)82/h5-9,13-16,20-23,35,38-39,45,47-57,87,100-101H,10-12,17-19,24-34,36-37,76H2,1-4H3,(H2,77,102)(H2,78,103)(H2,79,104)(H2,80,106)(H,88,107)(H,89,105)(H,90,108)(H,91,109)(H,92,115)(H,93,113)(H,94,112)(H,95,110)(H,96,111)(H,97,116)(H,98,114)(H4,81,82,85)(H4,83,84,86)/t45-,47-,48-,49-,50-,51-,52-,53-,54-,55-,56-,57-/m0/s1
Reactome pathway
1.00E+4n/an/an/an/an/an/an/an/a
University of Minnesota Health Science Center
Curated by ChEMBL
Assay Description
Displacement of [125]metastin from metastin receptor
J Med Chem 50: 462-71 (2007)
Article DOI: 10.1021/jm0609824
BindingDB Entry DOI: 10.7270/Q2HT2P0K
G-protein Coupled Receptor 54
(Homo sapiens (Human))
BDBM50203804
((2S)-2-{[(2S)-1-[(2S)-2-amino-4-methylpentanoyl]py...)
Show SMILES CC(C)C[C@H](N)C(=O)N1CCC[C@H]1C(=O)N[C@@H](CC(N)=O)C(=O)N[C@@H](Cc1ccc(O)cc1)C(=O)N[C@@H](CC(N)=O)C(=O)N[C@@H](Cc1c[nH]c2ccccc12)C(=O)N[C@@H](CC(N)=O)C(=O)N[C@@H](CO)C(=O)N[C@@H](Cc1ccccc1)C(=O)NCC(=O)N[C@@H](CC(C)C)C(=O)N[C@@H](CCCN=C(N)N)C(=O)N[C@@H](CCCN=C(N)N)C(N)=O |wU:4.4,72.75,87.91,36.37,12.13,106.110,58.61,wD:66.69,24.24,95.99,16.16,44.45,(-20.28,-19.15,;-20.26,-20.69,;-21.58,-21.47,;-18.91,-21.43,;-18.9,-22.99,;-20.24,-23.76,;-17.57,-23.76,;-17.57,-25.3,;-16.25,-22.99,;-15.77,-21.53,;-14.22,-21.54,;-13.74,-22.99,;-14.99,-23.9,;-14.99,-25.44,;-16.34,-26.21,;-13.67,-26.22,;-13.67,-27.76,;-15,-28.52,;-15,-30.06,;-13.68,-30.84,;-16.33,-30.83,;-12.34,-28.53,;-12.34,-30.07,;-10.99,-27.76,;-9.66,-28.53,;-9.66,-30.07,;-8.33,-30.84,;-8.33,-32.38,;-7.01,-33.15,;-5.66,-32.38,;-4.33,-33.15,;-5.67,-30.83,;-6.99,-30.07,;-8.32,-27.76,;-8.32,-26.22,;-6.99,-28.53,;-5.66,-27.77,;-5.66,-26.23,;-4.32,-25.46,;-2.99,-26.23,;-4.32,-23.92,;-4.32,-28.54,;-4.33,-30.08,;-2.99,-27.77,;-1.65,-28.54,;-1.66,-30.08,;-.33,-30.85,;.93,-29.86,;2.16,-30.85,;1.68,-32.32,;2.44,-33.63,;1.68,-34.96,;.14,-34.96,;-.62,-33.63,;.15,-32.31,;-.32,-27.77,;-.32,-26.23,;1.01,-28.54,;2.35,-27.77,;2.35,-26.23,;3.68,-25.47,;5.02,-26.24,;3.68,-23.93,;3.67,-28.55,;3.67,-30.09,;5.01,-27.78,;6.34,-28.55,;6.34,-30.09,;7.68,-30.86,;7.68,-27.78,;7.68,-26.24,;9.01,-28.55,;10.34,-27.78,;10.35,-26.24,;11.68,-25.48,;13.01,-26.24,;14.35,-25.48,;14.35,-23.93,;13.01,-23.16,;11.68,-23.94,;11.68,-28.56,;11.68,-30.1,;13.01,-27.79,;14.35,-28.55,;15.68,-27.78,;15.68,-26.24,;17.01,-28.55,;18.35,-27.78,;18.35,-26.24,;19.68,-25.48,;19.68,-23.94,;21.02,-26.25,;19.68,-28.56,;19.68,-30.1,;21.02,-27.79,;22.35,-28.56,;22.35,-30.1,;23.68,-30.87,;23.68,-32.41,;25.01,-33.18,;25.01,-34.72,;26.34,-35.49,;23.68,-35.49,;23.69,-27.79,;23.69,-26.25,;25.02,-28.56,;26.35,-27.79,;26.35,-26.25,;27.69,-25.48,;27.68,-23.95,;26.34,-23.19,;26.33,-21.65,;25,-20.88,;27.66,-20.87,;27.69,-28.57,;29.02,-27.8,;27.68,-30.11,)|
Show InChI InChI=1S/C75H110N24O18/c1-38(2)27-45(76)73(117)99-26-12-19-57(99)72(116)97-55(34-60(79)104)69(113)93-51(30-41-20-22-43(101)23-21-41)66(110)95-53(32-58(77)102)68(112)94-52(31-42-35-87-46-16-9-8-15-44(42)46)67(111)96-54(33-59(78)103)70(114)98-56(37-100)71(115)92-50(29-40-13-6-5-7-14-40)63(107)88-36-61(105)89-49(28-39(3)4)65(109)91-48(18-11-25-86-75(83)84)64(108)90-47(62(80)106)17-10-24-85-74(81)82/h5-9,13-16,20-23,35,38-39,45,47-57,87,100-101H,10-12,17-19,24-34,36-37,76H2,1-4H3,(H2,77,102)(H2,78,103)(H2,79,104)(H2,80,106)(H,88,107)(H,89,105)(H,90,108)(H,91,109)(H,92,115)(H,93,113)(H,94,112)(H,95,110)(H,96,111)(H,97,116)(H,98,114)(H4,81,82,85)(H4,83,84,86)/t45-,47-,48-,49-,50-,51-,52-,53-,54-,55-,56-,57-/m0/s1
Reactome pathway
n/an/an/an/a 1.00E+4n/an/an/an/a
University of Minnesota Health Science Center
Curated by ChEMBL
Assay Description
Activity at metastin receptor expressed in HEK293 cells by measuring calcium release
J Med Chem 50: 462-71 (2007)
Article DOI: 10.1021/jm0609824
BindingDB Entry DOI: 10.7270/Q2HT2P0K