BDBM50203896 CHEMBL374978::N-(4-{[(1-butyrylpiperidin-4-yl)amino]sulfonyl}-1-naphthyl)-4-ethylbenzamide
SMILES: CCCC(=O)N1CCC(CC1)NS(=O)(=O)c1ccc(NC(=O)c2ccc(CC)cc2)c2ccccc12
InChI Key: InChIKey=CWZVZOMPFAPIDY-UHFFFAOYSA-N
Data: 1 IC50
Activity Spreadsheet -- Enzyme Inhibition Constant Data from BindingDB
Found 1 hit for monomerid = 50203896
Trg + Lig
Ki
nM
ΔG°
kcal/mole
IC50
nM
Kd
nM
EC50/IC50
nM
koff
s-1
kon
M-1s-1
pHTemp
°C
C-C chemokine receptor type 8
(Homo sapiens (Human))
BDBM50203896
(CHEMBL374978 | N-(4-{[(1-butyrylpiperidin-4-yl)ami...)
Show SMILES CCCC(=O)N1CCC(CC1)NS(=O)(=O)c1ccc(NC(=O)c2ccc(CC)cc2)c2ccccc12
Show InChI InChI=1S/C28H33N3O4S/c1-3-7-27(32)31-18-16-22(17-19-31)30-36(34,35)26-15-14-25(23-8-5-6-9-24(23)26)29-28(33)21-12-10-20(4-2)11-13-21/h5-6,8-15,22,30H,3-4,7,16-19H2,1-2H3,(H,29,33)
Reactome pathway
n/an/a 10.8n/an/an/an/an/an/a
Millennium Pharmaceuticals
Curated by ChEMBL
Assay Description
Antagonist activity against human CCR8 expressed in CHO/Galpha16 cells assessed as inhibition of CCL1-induced increase of intracellular calcium by FL...
J Med Chem 50: 566-84 (2007)
Article DOI: 10.1021/jm061118e
BindingDB Entry DOI: 10.7270/Q24J0DSN