BDBM50203915 4-butyl-N-(4-{[(1-butyrylpiperidin-4-yl)amino]sulfonyl}-1-naphthyl)benzamide::CHEMBL221601
SMILES: CCCCc1ccc(cc1)C(=O)Nc1ccc(c2ccccc12)S(=O)(=O)NC1CCN(CC1)C(=O)CCC
InChI Key: InChIKey=NVAASLCBIDYYCA-UHFFFAOYSA-N
Data: 1 IC50
Activity Spreadsheet -- Enzyme Inhibition Constant Data from BindingDB
Found 1 hit for monomerid = 50203915
Trg + Lig
Ki
nM
ΔG°
kcal/mole
IC50
nM
Kd
nM
EC50/IC50
nM
koff
s-1
kon
M-1s-1
pHTemp
°C
C-C chemokine receptor type 8
(Homo sapiens (Human))
BDBM50203915
(4-butyl-N-(4-{[(1-butyrylpiperidin-4-yl)amino]sulf...)
Show SMILES CCCCc1ccc(cc1)C(=O)Nc1ccc(c2ccccc12)S(=O)(=O)NC1CCN(CC1)C(=O)CCC
Show InChI InChI=1S/C30H37N3O4S/c1-3-5-9-22-12-14-23(15-13-22)30(35)31-27-16-17-28(26-11-7-6-10-25(26)27)38(36,37)32-24-18-20-33(21-19-24)29(34)8-4-2/h6-7,10-17,24,32H,3-5,8-9,18-21H2,1-2H3,(H,31,35)
Reactome pathway
n/an/a 15.3n/an/an/an/an/an/a
Millennium Pharmaceuticals
Curated by ChEMBL
Assay Description
Antagonist activity against human CCR8 expressed in CHO/Galpha16 cells assessed as inhibition of CCL1-induced increase of intracellular calcium by FL...
J Med Chem 50: 566-84 (2007)
Article DOI: 10.1021/jm061118e
BindingDB Entry DOI: 10.7270/Q24J0DSN