BDBM50204195 2-(4-chlorophenoxy)-5-(4-chlorophenyl)-6-(2,4-dichlorophenyl)nicotinonitrile::CHEMBL391556
SMILES: Clc1ccc(Oc2nc(-c3ccc(Cl)cc3Cl)c(cc2C#N)-c2ccc(Cl)cc2)cc1
InChI Key: InChIKey=OMLGPXXIQYFOSM-UHFFFAOYSA-N
Data: 2 IC50
Activity Spreadsheet -- Enzyme Inhibition Constant Data from BindingDB
Found 2 hits for monomerid = 50204195
Trg + Lig
Ki
nM
ΔG°
kcal/mole
IC50
nM
Kd
nM
EC50/IC50
nM
koff
s-1
kon
M-1s-1
pHTemp
°C
Cannabinoid receptor 1
(Homo sapiens (Human))
BDBM50204195
(2-(4-chlorophenoxy)-5-(4-chlorophenyl)-6-(2,4-dich...)
Show SMILES Clc1ccc(Oc2nc(-c3ccc(Cl)cc3Cl)c(cc2C#N)-c2ccc(Cl)cc2)cc1
Show InChI InChI=1S/C24H12Cl4N2O/c25-16-3-1-14(2-4-16)21-11-15(13-29)24(31-19-8-5-17(26)6-9-19)30-23(21)20-10-7-18(27)12-22(20)28/h1-12H
NCI pathway
Reactome pathway
n/an/a 7n/an/an/an/an/an/a
Merck Research Laboratories
Curated by ChEMBL
Assay Description
Binding affinity at CB1 receptor
Bioorg Med Chem Lett 17: 2031-5 (2007)
Article DOI: 10.1016/j.bmcl.2007.01.005
BindingDB Entry DOI: 10.7270/Q27944BJ
Cannabinoid receptor 2
(Homo sapiens (Human))
BDBM50204195
(2-(4-chlorophenoxy)-5-(4-chlorophenyl)-6-(2,4-dich...)
Show SMILES Clc1ccc(Oc2nc(-c3ccc(Cl)cc3Cl)c(cc2C#N)-c2ccc(Cl)cc2)cc1
Show InChI InChI=1S/C24H12Cl4N2O/c25-16-3-1-14(2-4-16)21-11-15(13-29)24(31-19-8-5-17(26)6-9-19)30-23(21)20-10-7-18(27)12-22(20)28/h1-12H
Reactome pathway
n/an/a 4.20E+3n/an/an/an/an/an/a
Merck Research Laboratories
Curated by ChEMBL
Assay Description
Binding affinity at CB2 receptor
Bioorg Med Chem Lett 17: 2031-5 (2007)
Article DOI: 10.1016/j.bmcl.2007.01.005
BindingDB Entry DOI: 10.7270/Q27944BJ