null
SMILES: [H][C@@]12CS\C(=N\CCCC)N1[C@@H](CO)[C@H](O)[C@H]2O
InChI Key: InChIKey=FIPRTNUHGDMBHT-YZRAQKRASA-N
Activity Spreadsheet -- Enzyme Inhibition Constant Data from BindingDB
Found 1 hit for monomerid = 50204208
Trg + Lig
Ki
nM
ΔG°
kcal/mole
IC50
nM
Kd
nM
EC50/IC50
nM
koff
s-1
kon
M-1s-1
pHTemp
°C
Beta-galactosidase
(Bos taurus (Bovine))
BDBM50204208
(CHEMBL3910143)
Show SMILES [H][C@@]12CS\C(=N\CCCC)N1[C@@H](CO)[C@H](O)[C@H]2O |r|
Show InChI InChI=1S/C11H20N2O3S/c1-2-3-4-12-11-13-7(5-14)9(15)10(16)8(13)6-17-11/h7-10,14-16H,2-6H2,1H3/b12-11+/t7-,8-,9-,10-/m0/s1
n/an/a 7.19E+5n/an/an/an/an/an/a
University of Toyama
Curated by ChEMBL
Assay Description
Inhibition of bovine liver beta-galactosidase using p-nitrophenyl-glycoside as substrate by spectrophotometric method
Bioorg Med Chem 25: 107-115 (2017)
Article DOI: 10.1016/j.bmc.2016.10.015
BindingDB Entry DOI: 10.7270/Q26H4KC4