BDBM50204212 CHEMBL3901083
SMILES: [H][C@]12CS\C(=N\CCCCCCCCCCCC)N1[C@H](CO)[C@@H](O)[C@@H]2O
InChI Key: InChIKey=XUXSUVLIMDILDV-OBHYNVOVSA-N
Data: 1 IC50
Activity Spreadsheet -- Enzyme Inhibition Constant Data from BindingDB
Found 1 hit for monomerid = 50204212
Trg + Lig
Ki
nM
ΔG°
kcal/mole
IC50
nM
Kd
nM
EC50/IC50
nM
koff
s-1
kon
M-1s-1
pHTemp
°C
Beta-galactosidase
(Bos taurus (Bovine))
BDBM50204212
(CHEMBL3901083)
Show SMILES [H][C@]12CS\C(=N\CCCCCCCCCCCC)N1[C@H](CO)[C@@H](O)[C@@H]2O |r|
Show InChI InChI=1S/C19H36N2O3S/c1-2-3-4-5-6-7-8-9-10-11-12-20-19-21-15(13-22)17(23)18(24)16(21)14-25-19/h15-18,22-24H,2-14H2,1H3/b20-19+/t15-,16-,17-,18-/m1/s1
n/an/a 3.20E+4n/an/an/an/an/an/a
University of Toyama
Curated by ChEMBL
Assay Description
Inhibition of bovine liver beta-galactosidase using p-nitrophenyl-glycoside as substrate by spectrophotometric method
Bioorg Med Chem 25: 107-115 (2017)
Article DOI: 10.1016/j.bmc.2016.10.015
BindingDB Entry DOI: 10.7270/Q26H4KC4