BDBM50204286 CHEMBL3940901
SMILES: [H][C@]12CO[C@H](CN1CCN(C2)C(=O)Cc1ccc(nc1)-n1cnnn1)c1ccc2C(=O)OCCc2c1
InChI Key: InChIKey=JWYJNKHBNBBCQC-PZJWPPBQSA-N
Data: 1 IC50
Activity Spreadsheet -- Enzyme Inhibition Constant Data from BindingDB
Found 1 hit for monomerid = 50204286
Trg + Lig
Ki
nM
ΔG°
kcal/mole
IC50
nM
Kd
nM
EC50/IC50
nM
koff
s-1
kon
M-1s-1
pHTemp
°C
ATP-sensitive inward rectifier potassium channel 1
(Homo sapiens (Human))
BDBM50204286
(CHEMBL3940901)
Show SMILES [H][C@]12CO[C@H](CN1CCN(C2)C(=O)Cc1ccc(nc1)-n1cnnn1)c1ccc2C(=O)OCCc2c1 |r|
Show InChI InChI=1S/C24H25N7O4/c32-23(9-16-1-4-22(25-11-16)31-15-26-27-28-31)30-7-6-29-13-21(35-14-19(29)12-30)18-2-3-20-17(10-18)5-8-34-24(20)33/h1-4,10-11,15,19,21H,5-9,12-14H2/t19-,21+/m0/s1
Reactome pathway
n/an/a 205n/an/an/an/an/an/a
Merck Research Laboratories
Curated by ChEMBL
Assay Description
Inhibition of human ROMK expressed in CHO cells after 6 mins at -70 mV holding potential by electrophysiology method
Bioorg Med Chem Lett 26: 5695-5702 (2016)
Article DOI: 10.1016/j.bmcl.2016.10.064
BindingDB Entry DOI: 10.7270/Q2F191PS