BDBM50204393 (3S,4S)-N-hydroxy-4-(4-((2-methylquinolin-4-yl)methyl)benzamido)-1-neopentylpyrrolidine-3-carboxamide::CHEMBL234199
SMILES: Cc1cc(Cc2ccc(cc2)C(=O)N[C@@H]2CN(CC(C)(C)C)C[C@@H]2C(=O)NO)c2ccccc2n1
InChI Key: InChIKey=KEGZCMGJDRKBBL-UKILVPOCSA-N
Data: 6 IC50
Activity Spreadsheet -- Enzyme Inhibition Constant Data from BindingDB
Found 6 hits for monomerid = 50204393
Trg + Lig
Ki
nM
ΔG°
kcal/mole
IC50
nM
Kd
nM
EC50/IC50
nM
koff
s-1
kon
M-1s-1
pHTemp
°C
Matrix metalloproteinase-9
(Homo sapiens (Human))
BDBM50204393
((3S,4S)-N-hydroxy-4-(4-((2-methylquinolin-4-yl)met...)
Show SMILES Cc1cc(Cc2ccc(cc2)C(=O)N[C@@H]2CN(CC(C)(C)C)C[C@@H]2C(=O)NO)c2ccccc2n1
Show InChI InChI=1S/C28H34N4O3/c1-18-13-21(22-7-5-6-8-24(22)29-18)14-19-9-11-20(12-10-19)26(33)30-25-16-32(17-28(2,3)4)15-23(25)27(34)31-35/h5-13,23,25,35H,14-17H2,1-4H3,(H,30,33)(H,31,34)/t23-,25+/m0/s1
Reactome pathway
n/an/a>2.00E+3n/an/an/an/an/an/a
Bristol-Myers Squibb Pharmaceutical Research Institute
Curated by ChEMBL
Assay Description
Inhibition of MMP9
Bioorg Med Chem Lett 17: 1865-70 (2007)
Article DOI: 10.1016/j.bmcl.2007.01.041
BindingDB Entry DOI: 10.7270/Q2KK9BF4
72 kDa type IV collagenase
(Homo sapiens (Human))
BDBM50204393
((3S,4S)-N-hydroxy-4-(4-((2-methylquinolin-4-yl)met...)
Show SMILES Cc1cc(Cc2ccc(cc2)C(=O)N[C@@H]2CN(CC(C)(C)C)C[C@@H]2C(=O)NO)c2ccccc2n1
Show InChI InChI=1S/C28H34N4O3/c1-18-13-21(22-7-5-6-8-24(22)29-18)14-19-9-11-20(12-10-19)26(33)30-25-16-32(17-28(2,3)4)15-23(25)27(34)31-35/h5-13,23,25,35H,14-17H2,1-4H3,(H,30,33)(H,31,34)/t23-,25+/m0/s1
Reactome pathway
n/an/a>2.00E+3n/an/an/an/an/an/a
Bristol-Myers Squibb Pharmaceutical Research Institute
Curated by ChEMBL
Assay Description
Inhibition of MMP2
Bioorg Med Chem Lett 17: 1865-70 (2007)
Article DOI: 10.1016/j.bmcl.2007.01.041
BindingDB Entry DOI: 10.7270/Q2KK9BF4
Disintegrin and metalloproteinase domain-containing protein 17
(Homo sapiens (Human))
BDBM50204393
((3S,4S)-N-hydroxy-4-(4-((2-methylquinolin-4-yl)met...)
Show SMILES Cc1cc(Cc2ccc(cc2)C(=O)N[C@@H]2CN(CC(C)(C)C)C[C@@H]2C(=O)NO)c2ccccc2n1
Show InChI InChI=1S/C28H34N4O3/c1-18-13-21(22-7-5-6-8-24(22)29-18)14-19-9-11-20(12-10-19)26(33)30-25-16-32(17-28(2,3)4)15-23(25)27(34)31-35/h5-13,23,25,35H,14-17H2,1-4H3,(H,30,33)(H,31,34)/t23-,25+/m0/s1
Reactome pathway
n/an/a 700n/an/an/an/an/an/a
Bristol-Myers Squibb Pharmaceutical Research Institute
Curated by ChEMBL
Assay Description
Inhibition of TACE in human whole blood
Bioorg Med Chem Lett 17: 1865-70 (2007)
Article DOI: 10.1016/j.bmcl.2007.01.041
BindingDB Entry DOI: 10.7270/Q2KK9BF4
ADAM17
(Sus scrofa (pig))
BDBM50204393
((3S,4S)-N-hydroxy-4-(4-((2-methylquinolin-4-yl)met...)
Show SMILES Cc1cc(Cc2ccc(cc2)C(=O)N[C@@H]2CN(CC(C)(C)C)C[C@@H]2C(=O)NO)c2ccccc2n1
Show InChI InChI=1S/C28H34N4O3/c1-18-13-21(22-7-5-6-8-24(22)29-18)14-19-9-11-20(12-10-19)26(33)30-25-16-32(17-28(2,3)4)15-23(25)27(34)31-35/h5-13,23,25,35H,14-17H2,1-4H3,(H,30,33)(H,31,34)/t23-,25+/m0/s1
n/an/a 1.60n/an/an/an/an/an/a
Bristol-Myers Squibb Pharmaceutical Research Institute
Curated by ChEMBL
Assay Description
Inhibition of pig TACE
Bioorg Med Chem Lett 17: 1865-70 (2007)
Article DOI: 10.1016/j.bmcl.2007.01.041
BindingDB Entry DOI: 10.7270/Q2KK9BF4
Collagenase 3
(Homo sapiens (Human))
BDBM50204393
((3S,4S)-N-hydroxy-4-(4-((2-methylquinolin-4-yl)met...)
Show SMILES Cc1cc(Cc2ccc(cc2)C(=O)N[C@@H]2CN(CC(C)(C)C)C[C@@H]2C(=O)NO)c2ccccc2n1
Show InChI InChI=1S/C28H34N4O3/c1-18-13-21(22-7-5-6-8-24(22)29-18)14-19-9-11-20(12-10-19)26(33)30-25-16-32(17-28(2,3)4)15-23(25)27(34)31-35/h5-13,23,25,35H,14-17H2,1-4H3,(H,30,33)(H,31,34)/t23-,25+/m0/s1
NCI pathway
Reactome pathway
n/an/a>5.00E+3n/an/an/an/an/an/a
Bristol-Myers Squibb Pharmaceutical Research Institute
Curated by ChEMBL
Assay Description
Inhibition of MMP13
Bioorg Med Chem Lett 17: 1865-70 (2007)
Article DOI: 10.1016/j.bmcl.2007.01.041
BindingDB Entry DOI: 10.7270/Q2KK9BF4
Interstitial collagenase
(Homo sapiens (Human))
BDBM50204393
((3S,4S)-N-hydroxy-4-(4-((2-methylquinolin-4-yl)met...)
Show SMILES Cc1cc(Cc2ccc(cc2)C(=O)N[C@@H]2CN(CC(C)(C)C)C[C@@H]2C(=O)NO)c2ccccc2n1
Show InChI InChI=1S/C28H34N4O3/c1-18-13-21(22-7-5-6-8-24(22)29-18)14-19-9-11-20(12-10-19)26(33)30-25-16-32(17-28(2,3)4)15-23(25)27(34)31-35/h5-13,23,25,35H,14-17H2,1-4H3,(H,30,33)(H,31,34)/t23-,25+/m0/s1
Reactome pathway
n/an/a>5.00E+3n/an/an/an/an/an/a
Bristol-Myers Squibb Pharmaceutical Research Institute
Curated by ChEMBL
Assay Description
Inhibition of MMP1
Bioorg Med Chem Lett 17: 1865-70 (2007)
Article DOI: 10.1016/j.bmcl.2007.01.041
BindingDB Entry DOI: 10.7270/Q2KK9BF4