BDBM50204404 (3S,4S)-tert-butyl 3-(hydroxycarbamoyl)-4-(4-((2-methylquinolin-4-yl)methyl)benzamido)pyrrolidine-1-carboxylate::CHEMBL399604
SMILES: Cc1cc(Cc2ccc(cc2)C(=O)N[C@@H]2CN(C[C@@H]2C(=O)NO)C(=O)OC(C)(C)C)c2ccccc2n1
InChI Key: InChIKey=CXBWDVDCCWRTQK-LADGPHEKSA-N
Data: 2 IC50
Activity Spreadsheet -- Enzyme Inhibition Constant Data from BindingDB
Found 2 hits for monomerid = 50204404
Trg + Lig
Ki
nM
ΔG°
kcal/mole
IC50
nM
Kd
nM
EC50/IC50
nM
koff
s-1
kon
M-1s-1
pHTemp
°C
Disintegrin and metalloproteinase domain-containing protein 17
(Homo sapiens (Human))
BDBM50204404
((3S,4S)-tert-butyl 3-(hydroxycarbamoyl)-4-(4-((2-m...)
Show SMILES Cc1cc(Cc2ccc(cc2)C(=O)N[C@@H]2CN(C[C@@H]2C(=O)NO)C(=O)OC(C)(C)C)c2ccccc2n1
Show InChI InChI=1S/C28H32N4O5/c1-17-13-20(21-7-5-6-8-23(21)29-17)14-18-9-11-19(12-10-18)25(33)30-24-16-32(15-22(24)26(34)31-36)27(35)37-28(2,3)4/h5-13,22,24,36H,14-16H2,1-4H3,(H,30,33)(H,31,34)/t22-,24+/m0/s1
Reactome pathway
n/an/a 96n/an/an/an/an/an/a
Bristol-Myers Squibb Pharmaceutical Research Institute
Curated by ChEMBL
Assay Description
Inhibition of TACE in human whole blood
Bioorg Med Chem Lett 17: 1865-70 (2007)
Article DOI: 10.1016/j.bmcl.2007.01.041
BindingDB Entry DOI: 10.7270/Q2KK9BF4
ADAM17
(Sus scrofa (pig))
BDBM50204404
((3S,4S)-tert-butyl 3-(hydroxycarbamoyl)-4-(4-((2-m...)
Show SMILES Cc1cc(Cc2ccc(cc2)C(=O)N[C@@H]2CN(C[C@@H]2C(=O)NO)C(=O)OC(C)(C)C)c2ccccc2n1
Show InChI InChI=1S/C28H32N4O5/c1-17-13-20(21-7-5-6-8-23(21)29-17)14-18-9-11-19(12-10-18)25(33)30-24-16-32(15-22(24)26(34)31-36)27(35)37-28(2,3)4/h5-13,22,24,36H,14-16H2,1-4H3,(H,30,33)(H,31,34)/t22-,24+/m0/s1
n/an/a<1n/an/an/an/an/an/a
Bristol-Myers Squibb Pharmaceutical Research Institute
Curated by ChEMBL
Assay Description
Inhibition of pig TACE
Bioorg Med Chem Lett 17: 1865-70 (2007)
Article DOI: 10.1016/j.bmcl.2007.01.041
BindingDB Entry DOI: 10.7270/Q2KK9BF4