BDBM50204491 1-(5-(4-fluoropyridin-2-yl)oxazol-2-yl)-7-phenylheptan-1-one::CHEMBL220679
SMILES: Fc1ccnc(c1)-c1cnc(o1)C(=O)CCCCCCc1ccccc1
InChI Key: InChIKey=BRIZPUVXNAJYDO-UHFFFAOYSA-N
Data: 1 KI  3 IC50
Activity Spreadsheet -- Enzyme Inhibition Constant Data from BindingDB
Found 4 hits for monomerid = 50204491
Trg + Lig
Ki
nM
ΔG°
kcal/mole
IC50
nM
Kd
nM
EC50/IC50
nM
koff
s-1
kon
M-1s-1
pHTemp
°C
Fatty-acid amide hydrolase 1
(Homo sapiens (Human))
BDBM50204491
(1-(5-(4-fluoropyridin-2-yl)oxazol-2-yl)-7-phenylhe...)
Show SMILES Fc1ccnc(c1)-c1cnc(o1)C(=O)CCCCCCc1ccccc1
Show InChI InChI=1S/C21H21FN2O2/c22-17-12-13-23-18(14-17)20-15-24-21(26-20)19(25)11-7-2-1-4-8-16-9-5-3-6-10-16/h3,5-6,9-10,12-15H,1-2,4,7-8,11H2
2n/an/an/an/an/an/an/an/a
The Scripps Research Institute
Curated by ChEMBL
Assay Description
Inhibition of rat recombinant FAAH expressed in Escherichia coli by [14C]oleamide breakdown
J Med Chem 50: 1058-68 (2007)
Article DOI: 10.1021/jm0611509
BindingDB Entry DOI: 10.7270/Q26H4J6G
Fatty-acid amide hydrolase 1
(Homo sapiens (Human))
BDBM50204491
(1-(5-(4-fluoropyridin-2-yl)oxazol-2-yl)-7-phenylhe...)
Show SMILES Fc1ccnc(c1)-c1cnc(o1)C(=O)CCCCCCc1ccccc1
Show InChI InChI=1S/C21H21FN2O2/c22-17-12-13-23-18(14-17)20-15-24-21(26-20)19(25)11-7-2-1-4-8-16-9-5-3-6-10-16/h3,5-6,9-10,12-15H,1-2,4,7-8,11H2
n/an/a 2.5n/an/an/an/an/an/a
The Scripps Research Institute
Curated by ChEMBL
Assay Description
Inhibition of rat recombinant FAAH expressed in Escherichia coli by [14C]oleamide breakdown
J Med Chem 50: 1058-68 (2007)
Article DOI: 10.1021/jm0611509
BindingDB Entry DOI: 10.7270/Q26H4J6G
Acyl-CoA: cholesterol acyltransferase (ACAT)
(Homo sapiens (Human))
BDBM50204491
(1-(5-(4-fluoropyridin-2-yl)oxazol-2-yl)-7-phenylhe...)
Show SMILES Fc1ccnc(c1)-c1cnc(o1)C(=O)CCCCCCc1ccccc1
Show InChI InChI=1S/C21H21FN2O2/c22-17-12-13-23-18(14-17)20-15-24-21(26-20)19(25)11-7-2-1-4-8-16-9-5-3-6-10-16/h3,5-6,9-10,12-15H,1-2,4,7-8,11H2
n/an/a 600n/an/an/an/an/an/a
The Scripps Research Institute
Curated by ChEMBL
Assay Description
Inhibition of TGH
J Med Chem 50: 1058-68 (2007)
Article DOI: 10.1021/jm0611509
BindingDB Entry DOI: 10.7270/Q26H4J6G
Neutral cholesterol ester hydrolase 1
(Homo sapiens (Human))
BDBM50204491
(1-(5-(4-fluoropyridin-2-yl)oxazol-2-yl)-7-phenylhe...)
Show SMILES Fc1ccnc(c1)-c1cnc(o1)C(=O)CCCCCCc1ccccc1
Show InChI InChI=1S/C21H21FN2O2/c22-17-12-13-23-18(14-17)20-15-24-21(26-20)19(25)11-7-2-1-4-8-16-9-5-3-6-10-16/h3,5-6,9-10,12-15H,1-2,4,7-8,11H2
n/an/a>1.00E+5n/an/an/an/an/an/a
The Scripps Research Institute
Curated by ChEMBL
Assay Description
Inhibition of KIAA1363
J Med Chem 50: 1058-68 (2007)
Article DOI: 10.1021/jm0611509
BindingDB Entry DOI: 10.7270/Q26H4J6G