BDBM50204552 CHEMBL3959948
SMILES: CCC[C@@H]1C\C(C[C@@]2(O1)C(=O)Nc1ccccc21)=N\OCc1ccccc1
InChI Key: InChIKey=PVYMEAANGXOWGU-FVHXMZMJSA-N
Data: 2 IC50
Activity Spreadsheet -- Enzyme Inhibition Constant Data from BindingDB
Found 2 hits for monomerid = 50204552
Trg + Lig
Ki
nM
ΔG°
kcal/mole
IC50
nM
Kd
nM
EC50/IC50
nM
koff
s-1
kon
M-1s-1
pHTemp
°C
Sterol O-acyltransferase 2
(Chlorocebus aethiops)
BDBM50204552
(CHEMBL3959948)
Show SMILES CCC[C@@H]1C\C(C[C@@]2(O1)C(=O)Nc1ccccc21)=N\OCc1ccccc1 |r|
Show InChI InChI=1S/C22H24N2O3/c1-2-8-18-13-17(24-26-15-16-9-4-3-5-10-16)14-22(27-18)19-11-6-7-12-20(19)23-21(22)25/h3-7,9-12,18H,2,8,13-15H2,1H3,(H,23,25)/b24-17-/t18-,22+/m1/s1
n/an/a 1.50E+3n/an/an/an/an/an/a
Kitasato University
Curated by ChEMBL
Assay Description
Inhibition of African green monkey SOAT2 expressed in CHO cells assessed as reduction in [14C]cholesteryl ester formation from [1-14C]oleic acid meas...
Bioorg Med Chem Lett 26: 5899-5901 (2016)
Article DOI: 10.1016/j.bmcl.2016.11.008
BindingDB Entry DOI: 10.7270/Q2D220KD
Sterol O-acyltransferase 1
(Chlorocebus aethiops)
BDBM50204552
(CHEMBL3959948)
Show SMILES CCC[C@@H]1C\C(C[C@@]2(O1)C(=O)Nc1ccccc21)=N\OCc1ccccc1 |r|
Show InChI InChI=1S/C22H24N2O3/c1-2-8-18-13-17(24-26-15-16-9-4-3-5-10-16)14-22(27-18)19-11-6-7-12-20(19)23-21(22)25/h3-7,9-12,18H,2,8,13-15H2,1H3,(H,23,25)/b24-17-/t18-,22+/m1/s1
n/an/a 1.60E+4n/an/an/an/an/an/a
Kitasato University
Curated by ChEMBL
Assay Description
Inhibition of African green monkey SOAT1 expressed in CHO cells assessed as reduction in [14C]cholesteryl ester formation from [1-14C]oleic acid meas...
Bioorg Med Chem Lett 26: 5899-5901 (2016)
Article DOI: 10.1016/j.bmcl.2016.11.008
BindingDB Entry DOI: 10.7270/Q2D220KD