BDBM50204714 4'-{6-[(2-hydroxy-ethylamino)-methyl]-1,4-dihydro-indeno[1,2-c]pyrazol-3-yl}-biphenyl-4-ol::CHEMBL389378
SMILES: OCCNCc1ccc-2c(Cc3c(n[nH]c-23)-c2ccc(cc2)-c2ccc(O)cc2)c1
InChI Key: InChIKey=OXBQUAIHFATQIM-UHFFFAOYSA-N
Data: 1 IC50
Activity Spreadsheet -- Enzyme Inhibition Constant Data from BindingDB
Found 1 hit for monomerid = 50204714
Trg + Lig
Ki
nM
ΔG°
kcal/mole
IC50
nM
Kd
nM
EC50/IC50
nM
koff
s-1
kon
M-1s-1
pHTemp
°C
Serine/threonine-protein kinase Chk1
(Homo sapiens (Human))
BDBM50204714
(4'-{6-[(2-hydroxy-ethylamino)-methyl]-1,4-dihydro-...)
Show SMILES OCCNCc1ccc-2c(Cc3c(n[nH]c-23)-c2ccc(cc2)-c2ccc(O)cc2)c1
Show InChI InChI=1S/C25H23N3O2/c29-12-11-26-15-16-1-10-22-20(13-16)14-23-24(27-28-25(22)23)19-4-2-17(3-5-19)18-6-8-21(30)9-7-18/h1-10,13,26,29-30H,11-12,14-15H2,(H,27,28)
Reactome pathway
n/an/a 6.60n/an/an/an/an/an/a
Abbott Laboratories
Curated by ChEMBL
Assay Description
Inhibition of recombinant CHK1 assessed as human Cdc25C phosphorylation
Bioorg Med Chem 15: 2759-67 (2007)
Article DOI: 10.1016/j.bmc.2007.01.012
BindingDB Entry DOI: 10.7270/Q2XS5V22
3D
3D Structure (docked)