BDBM50204805 (R)-N-(4-(4-hydroxyphenyl)butan-2-yl)-2-(2-phenyl-6-(3-(piperidin-1-yl)propoxy)-1H-indol-3-yl)acetamide::CHEMBL241304
SMILES: C[C@H](CCc1ccc(O)cc1)NC(=O)Cc1c([nH]c2cc(OCCCN3CCCCC3)ccc12)-c1ccccc1
InChI Key: InChIKey=XOFSATVVFHWQNG-RUZDIDTESA-N
Data: 2 IC50
Activity Spreadsheet -- Enzyme Inhibition Constant Data from BindingDB
Found 2 hits for monomerid = 50204805
Trg + Lig
Ki
nM
ΔG°
kcal/mole
IC50
nM
Kd
nM
EC50/IC50
nM
koff
s-1
kon
M-1s-1
pHTemp
°C
Estrogen receptor
(Homo sapiens (Human))
BDBM50204805
((R)-N-(4-(4-hydroxyphenyl)butan-2-yl)-2-(2-phenyl-...)
Show SMILES C[C@H](CCc1ccc(O)cc1)NC(=O)Cc1c([nH]c2cc(OCCCN3CCCCC3)ccc12)-c1ccccc1
Show InChI InChI=1S/C34H41N3O3/c1-25(11-12-26-13-15-28(38)16-14-26)35-33(39)24-31-30-18-17-29(40-22-8-21-37-19-6-3-7-20-37)23-32(30)36-34(31)27-9-4-2-5-10-27/h2,4-5,9-10,13-18,23,25,36,38H,3,6-8,11-12,19-22,24H2,1H3,(H,35,39)/t25-/m1/s1
n/an/a 13n/an/an/an/an/an/a
Merck Research Laboratories
Curated by ChEMBL
Assay Description
Displacement of [3H]estradiol from full length human recombinant ERalpha after 3 hrs by scintillation proximity assay
Bioorg Med Chem Lett 17: 2322-8 (2007)
Article DOI: 10.1016/j.bmcl.2007.01.054
BindingDB Entry DOI: 10.7270/Q2PC322G
Estradiol receptor beta (ERβ)
(Homo sapiens (Human))
BDBM50204805
((R)-N-(4-(4-hydroxyphenyl)butan-2-yl)-2-(2-phenyl-...)
Show SMILES C[C@H](CCc1ccc(O)cc1)NC(=O)Cc1c([nH]c2cc(OCCCN3CCCCC3)ccc12)-c1ccccc1
Show InChI InChI=1S/C34H41N3O3/c1-25(11-12-26-13-15-28(38)16-14-26)35-33(39)24-31-30-18-17-29(40-22-8-21-37-19-6-3-7-20-37)23-32(30)36-34(31)27-9-4-2-5-10-27/h2,4-5,9-10,13-18,23,25,36,38H,3,6-8,11-12,19-22,24H2,1H3,(H,35,39)/t25-/m1/s1
n/an/a 2.34E+3n/an/an/an/an/an/a
Merck Research Laboratories
Curated by ChEMBL
Assay Description
Displacement of [3H]estradiol from full length human recombinant ERbeta after 3 hrs by scintillation proximity assay
Bioorg Med Chem Lett 17: 2322-8 (2007)
Article DOI: 10.1016/j.bmcl.2007.01.054
BindingDB Entry DOI: 10.7270/Q2PC322G