BDBM50205527 CHEMBL221504::N-(((2S,4R)-1-(2-(2,4-difluorobenzoyl)benzoyl)-4-(tritylthio)pyrrolidin-2-yl)methyl)-4-((Z)-(2,4-dioxothiazolidin-5-ylidene)methyl)benzamide
SMILES: Fc1ccc(C(=O)c2ccccc2C(=O)N2C[C@@H](C[C@H]2CNC(=O)c2ccc(\C=C3/SC(=O)NC3=O)cc2)SC(c2ccccc2)(c2ccccc2)c2ccccc2)c(F)c1
InChI Key: InChIKey=XSCZRVUQXBBTRO-GYCZXHFISA-N
Data: 1 IC50
Activity Spreadsheet -- Enzyme Inhibition Constant Data from BindingDB
Found 1 hit for monomerid = 50205527
Trg + Lig
Ki
nM
ΔG°
kcal/mole
IC50
nM
Kd
nM
EC50/IC50
nM
koff
s-1
kon
M-1s-1
pHTemp
°C
cPLA2 C2
(Homo sapiens (Human))
BDBM50205527
(CHEMBL221504 | N-(((2S,4R)-1-(2-(2,4-difluorobenzo...)
Show SMILES Fc1ccc(C(=O)c2ccccc2C(=O)N2C[C@@H](C[C@H]2CNC(=O)c2ccc(\C=C3/SC(=O)NC3=O)cc2)SC(c2ccccc2)(c2ccccc2)c2ccccc2)c(F)c1
Show InChI InChI=1S/C49H37F2N3O5S2/c50-36-24-25-41(42(51)27-36)44(55)39-18-10-11-19-40(39)47(58)54-30-38(28-37(54)29-52-45(56)32-22-20-31(21-23-32)26-43-46(57)53-48(59)60-43)61-49(33-12-4-1-5-13-33,34-14-6-2-7-15-34)35-16-8-3-9-17-35/h1-27,37-38H,28-30H2,(H,52,56)(H,53,57,59)/b43-26-/t37-,38+/m0/s1
n/an/a 110n/an/an/an/an/an/a
Wyeth Research
Curated by ChEMBL
Assay Description
Inhibition of human cPLA2 alpha by GLU micelle assay
J Med Chem 50: 1380-400 (2007)
Article DOI: 10.1021/jm061131z
BindingDB Entry DOI: 10.7270/Q23F4PB9