BDBM50205585 (2S,3S,4R,5R)-N-ethyl-5-(6-(4-(2-(4-fluorophenylamino)-2-oxoethoxy)phenylamino)-9H-purin-9-yl)-3,4-dihydroxy-tetrahydrofuran-2-carboxamide::1-deoxy-1-[6-{4-[(4-fluoro-phenylcarbamoyl)-methoxy]-phenylamino}-9H-purin-9-yl]-N-ethyl-beta-D-ribofuranuronamide::CHEMBL226194
SMILES: CCNC(=O)[C@H]1O[C@H]([C@H](O)[C@@H]1O)n1cnc2c(Nc3ccc(OCC(=O)Nc4ccc(F)cc4)cc3)ncnc12
InChI Key: InChIKey=JSPRYGRDFHTFCE-IMIIHFCZSA-N
Data: 3 KI  2 EC50
Activity Spreadsheet -- Enzyme Inhibition Constant Data from BindingDB
Found 5 hits for monomerid = 50205585
Trg + Lig
Ki
nM
ΔG°
kcal/mole
IC50
nM
Kd
nM
EC50/IC50
nM
koff
s-1
kon
M-1s-1
pHTemp
°C
Adenosine receptor A1
(Homo sapiens (Human))
BDBM50205585
((2S,3S,4R,5R)-N-ethyl-5-(6-(4-(2-(4-fluorophenylam...)
Show SMILES CCNC(=O)[C@H]1O[C@H]([C@H](O)[C@@H]1O)n1cnc2c(Nc3ccc(OCC(=O)Nc4ccc(F)cc4)cc3)ncnc12
Show InChI InChI=1S/C26H26FN7O6/c1-2-28-25(38)22-20(36)21(37)26(40-22)34-13-31-19-23(29-12-30-24(19)34)33-16-7-9-17(10-8-16)39-11-18(35)32-15-5-3-14(27)4-6-15/h3-10,12-13,20-22,26,36-37H,2,11H2,1H3,(H,28,38)(H,32,35)(H,29,30,33)/t20-,21+,22-,26+/m0/s1
Reactome pathway
2.30n/an/an/an/an/an/an/an/a
Universit£ di Ferrara
Curated by ChEMBL
Assay Description
Displacement of [3H]CHA from human adenosine A1 receptor expressed in CHO cells
Bioorg Med Chem 15: 2514-27 (2007)
Article DOI: 10.1016/j.bmc.2007.01.055
BindingDB Entry DOI: 10.7270/Q2R78G14
Adenosine receptor A3
(Homo sapiens (Human))
BDBM50205585
((2S,3S,4R,5R)-N-ethyl-5-(6-(4-(2-(4-fluorophenylam...)
Show SMILES CCNC(=O)[C@H]1O[C@H]([C@H](O)[C@@H]1O)n1cnc2c(Nc3ccc(OCC(=O)Nc4ccc(F)cc4)cc3)ncnc12
Show InChI InChI=1S/C26H26FN7O6/c1-2-28-25(38)22-20(36)21(37)26(40-22)34-13-31-19-23(29-12-30-24(19)34)33-16-7-9-17(10-8-16)39-11-18(35)32-15-5-3-14(27)4-6-15/h3-10,12-13,20-22,26,36-37H,2,11H2,1H3,(H,28,38)(H,32,35)(H,29,30,33)/t20-,21+,22-,26+/m0/s1
Reactome pathway
72.3n/an/an/an/an/an/an/an/a
Universit£ di Ferrara
Curated by ChEMBL
Assay Description
Displacement of [3H]ABMECA from human adenosine A3 receptor expressed in CHO cells
Bioorg Med Chem 15: 2514-27 (2007)
Article DOI: 10.1016/j.bmc.2007.01.055
BindingDB Entry DOI: 10.7270/Q2R78G14
Adenosine receptor A2a
(Homo sapiens (Human))
BDBM50205585
((2S,3S,4R,5R)-N-ethyl-5-(6-(4-(2-(4-fluorophenylam...)
Show SMILES CCNC(=O)[C@H]1O[C@H]([C@H](O)[C@@H]1O)n1cnc2c(Nc3ccc(OCC(=O)Nc4ccc(F)cc4)cc3)ncnc12
Show InChI InChI=1S/C26H26FN7O6/c1-2-28-25(38)22-20(36)21(37)26(40-22)34-13-31-19-23(29-12-30-24(19)34)33-16-7-9-17(10-8-16)39-11-18(35)32-15-5-3-14(27)4-6-15/h3-10,12-13,20-22,26,36-37H,2,11H2,1H3,(H,28,38)(H,32,35)(H,29,30,33)/t20-,21+,22-,26+/m0/s1
NCI pathway
Reactome pathway
>1.00E+3n/an/an/an/an/an/an/an/a
Universit£ di Ferrara
Curated by ChEMBL
Assay Description
Displacement of [3H]CGS-21680 from human adenosine A2A receptor expressed in CHO cells
Bioorg Med Chem 15: 2514-27 (2007)
Article DOI: 10.1016/j.bmc.2007.01.055
BindingDB Entry DOI: 10.7270/Q2R78G14
Adenosine receptor A2b
(Homo sapiens (Human))
BDBM50205585
((2S,3S,4R,5R)-N-ethyl-5-(6-(4-(2-(4-fluorophenylam...)
Show SMILES CCNC(=O)[C@H]1O[C@H]([C@H](O)[C@@H]1O)n1cnc2c(Nc3ccc(OCC(=O)Nc4ccc(F)cc4)cc3)ncnc12
Show InChI InChI=1S/C26H26FN7O6/c1-2-28-25(38)22-20(36)21(37)26(40-22)34-13-31-19-23(29-12-30-24(19)34)33-16-7-9-17(10-8-16)39-11-18(35)32-15-5-3-14(27)4-6-15/h3-10,12-13,20-22,26,36-37H,2,11H2,1H3,(H,28,38)(H,32,35)(H,29,30,33)/t20-,21+,22-,26+/m0/s1
NCI pathway
Reactome pathway
n/an/an/an/a 6.58E+7n/an/an/an/a
National Institute of Diabetes and Digestive and Kidney Diseases
Curated by ChEMBL
Assay Description
Agonist activity at human adenosine A2B receptor expressed in CHO cells assessed as stimulation of adenylate cyclase
J Med Chem 51: 2088-99 (2008)
Article DOI: 10.1021/jm701442d
BindingDB Entry DOI: 10.7270/Q2R49RNV
Adenosine receptor A2b
(Homo sapiens (Human))
BDBM50205585
((2S,3S,4R,5R)-N-ethyl-5-(6-(4-(2-(4-fluorophenylam...)
Show SMILES CCNC(=O)[C@H]1O[C@H]([C@H](O)[C@@H]1O)n1cnc2c(Nc3ccc(OCC(=O)Nc4ccc(F)cc4)cc3)ncnc12
Show InChI InChI=1S/C26H26FN7O6/c1-2-28-25(38)22-20(36)21(37)26(40-22)34-13-31-19-23(29-12-30-24(19)34)33-16-7-9-17(10-8-16)39-11-18(35)32-15-5-3-14(27)4-6-15/h3-10,12-13,20-22,26,36-37H,2,11H2,1H3,(H,28,38)(H,32,35)(H,29,30,33)/t20-,21+,22-,26+/m0/s1
NCI pathway
Reactome pathway
n/an/an/an/a 15.2n/an/an/an/a
Universit£ di Ferrara
Curated by ChEMBL
Assay Description
Agonist activity at human adenosine A2B receptor expressed in CHO cells assessed as stimulation of cAMP production
Bioorg Med Chem 15: 2514-27 (2007)
Article DOI: 10.1016/j.bmc.2007.01.055
BindingDB Entry DOI: 10.7270/Q2R78G14