BDBM50205607 CHEMBL3925358
SMILES: COc1ccc(cc1OC)C1=NN(CC(N)=O)C(=O)CCC1
InChI Key: InChIKey=ADADMYVBLRGGDV-UHFFFAOYSA-N
Data: 1 IC50
Activity Spreadsheet -- Enzyme Inhibition Constant Data from BindingDB
Found 1 hit for monomerid = 50205607
Trg + Lig
Ki
nM
ΔG°
kcal/mole
IC50
nM
Kd
nM
EC50/IC50
nM
koff
s-1
kon
M-1s-1
pHTemp
°C
cAMP-specific 3',5'-cyclic phosphodiesterase 4B
(Homo sapiens (Human))
BDBM50205607
(CHEMBL3925358)
Show SMILES COc1ccc(cc1OC)C1=NN(CC(N)=O)C(=O)CCC1 |t:11|
Show InChI InChI=1S/C15H19N3O4/c1-21-12-7-6-10(8-13(12)22-2)11-4-3-5-15(20)18(17-11)9-14(16)19/h6-8H,3-5,9H2,1-2H3,(H2,16,19)
n/an/a 7.55E+3n/an/an/an/an/an/a
University of Genoa
Curated by ChEMBL
Assay Description
Inhibition of human recombinant PDE4B2 using cAMP as substrate after 2 hrs by TR-FRET assay
Bioorg Med Chem Lett 27: 24-29 (2017)
Article DOI: 10.1016/j.bmcl.2016.11.040
BindingDB Entry DOI: 10.7270/Q21N8333