BDBM50205637 CHEMBL3896239
SMILES: CC1CN(CC2CC2)c2cc(cc(C(=O)NCc3c(C)cc(C)[nH]c3=O)c12)-c1ccc(CN2CCOCC2)cc1
InChI Key: InChIKey=PYGGXHPKSYBVSY-UHFFFAOYSA-N
Data: 2 IC50
Activity Spreadsheet -- Enzyme Inhibition Constant Data from BindingDB
Found 2 hits for monomerid = 50205637
Trg + Lig
Ki
nM
ΔG°
kcal/mole
IC50
nM
Kd
nM
EC50/IC50
nM
koff
s-1
kon
M-1s-1
pHTemp
°C
Histone-lysine N-methyltransferase EZH2
(Homo sapiens (Human))
BDBM50205637
(CHEMBL3896239)
Show SMILES CC1CN(CC2CC2)c2cc(cc(C(=O)NCc3c(C)cc(C)[nH]c3=O)c12)-c1ccc(CN2CCOCC2)cc1
Show InChI InChI=1S/C33H40N4O3/c1-21-14-23(3)35-33(39)29(21)17-34-32(38)28-15-27(16-30-31(28)22(2)18-37(30)20-25-4-5-25)26-8-6-24(7-9-26)19-36-10-12-40-13-11-36/h6-9,14-16,22,25H,4-5,10-13,17-20H2,1-3H3,(H,34,38)(H,35,39)
n/an/a 375n/an/an/an/an/an/a
Integral BioSciences Pvt. Ltd.
Curated by ChEMBL
Assay Description
Inhibition of human wild type EZH2 using histone H3 as substrate after 1 hr in presence of 3H-SAM by filter paper detection analysis
Bioorg Med Chem Lett 27: 217-222 (2017)
Article DOI: 10.1016/j.bmcl.2016.11.080
BindingDB Entry DOI: 10.7270/Q2S46TZW
Histone-lysine N-methyltransferase EZH2
(Homo sapiens (Human))
BDBM50205637
(CHEMBL3896239)
Show SMILES CC1CN(CC2CC2)c2cc(cc(C(=O)NCc3c(C)cc(C)[nH]c3=O)c12)-c1ccc(CN2CCOCC2)cc1
Show InChI InChI=1S/C33H40N4O3/c1-21-14-23(3)35-33(39)29(21)17-34-32(38)28-15-27(16-30-31(28)22(2)18-37(30)20-25-4-5-25)26-8-6-24(7-9-26)19-36-10-12-40-13-11-36/h6-9,14-16,22,25H,4-5,10-13,17-20H2,1-3H3,(H,34,38)(H,35,39)
n/an/a 1.52E+4n/an/an/an/an/an/a
Integral BioSciences Pvt. Ltd.
Curated by ChEMBL
Assay Description
Inhibition of human wild type EZH2 using histone H3 as substrate after 1 hr in presence of 3H-SAM by filter paper detection analysis
Bioorg Med Chem Lett 27: 217-222 (2017)
Article DOI: 10.1016/j.bmcl.2016.11.080
BindingDB Entry DOI: 10.7270/Q2S46TZW