null
SMILES: CN([C@H](CN1CC[C@H](O)C1)c1ccccc1)C(=O)CC(=O)Nc1nccs1
InChI Key: InChIKey=OTVDTTAKAMCEFZ-JKSUJKDBSA-N
Activity Spreadsheet -- Enzyme Inhibition Constant Data from BindingDB
Found 2 hits for monomerid = 50205686
Trg + Lig
Ki
nM
ΔG°
kcal/mole
IC50
nM
Kd
nM
EC50/IC50
nM
koff
s-1
kon
M-1s-1
pHTemp
°C
Kappa-type opioid receptor
(Homo sapiens (Human))
BDBM50205686
(CHEMBL230607 | N1-((S)-2-((S)-3-hydroxypyrrolidin-...)
Show SMILES CN([C@H](CN1CC[C@H](O)C1)c1ccccc1)C(=O)CC(=O)Nc1nccs1
Show InChI InChI=1S/C19H24N4O3S/c1-22(18(26)11-17(25)21-19-20-8-10-27-19)16(14-5-3-2-4-6-14)13-23-9-7-15(24)12-23/h2-6,8,10,15-16,24H,7,9,11-13H2,1H3,(H,20,21,25)/t15-,16+/m0/s1
Reactome pathway
0.530n/an/an/an/an/an/an/an/a
Adolor Corporation
Curated by ChEMBL
Assay Description
Agonist activity at human kappa opioid receptor by [35S]GTPgammaS binding assay
Bioorg Med Chem Lett 17: 1951-5 (2007)
Article DOI: 10.1016/j.bmcl.2007.01.053
BindingDB Entry DOI: 10.7270/Q2Q52P9X
Cytochrome P450 2D6
(Homo sapiens (Human))
BDBM50205686
(CHEMBL230607 | N1-((S)-2-((S)-3-hydroxypyrrolidin-...)
Show SMILES CN([C@H](CN1CC[C@H](O)C1)c1ccccc1)C(=O)CC(=O)Nc1nccs1
Show InChI InChI=1S/C19H24N4O3S/c1-22(18(26)11-17(25)21-19-20-8-10-27-19)16(14-5-3-2-4-6-14)13-23-9-7-15(24)12-23/h2-6,8,10,15-16,24H,7,9,11-13H2,1H3,(H,20,21,25)/t15-,16+/m0/s1
n/an/a 700n/an/an/an/an/an/a
Adolor Corporation
Curated by ChEMBL
Assay Description
Inhibition of CYP2D6
Bioorg Med Chem Lett 17: 1951-5 (2007)
Article DOI: 10.1016/j.bmcl.2007.01.053
BindingDB Entry DOI: 10.7270/Q2Q52P9X