BDBM50205924 CHEMBL223384::N-[(1,3-benzodioxol-5-yl)methyl]-1-[2-(1H-imidazol-1-yl)pyrimidin-4-yl]-4-[(methylamino)carbonyl]-2-piperazineacetamide
SMILES: CNC(=O)N1CCN(C(CC(=O)NCc2ccc3OCOc3c2)C1)c1ccnc(n1)-n1ccnc1
InChI Key: InChIKey=PIQCDPVLMAIZFH-UHFFFAOYSA-N
Data: 1 IC50
Activity Spreadsheet -- Enzyme Inhibition Constant Data from BindingDB
Found 1 hit for monomerid = 50205924
Trg + Lig
Ki
nM
ΔG°
kcal/mole
IC50
nM
Kd
nM
EC50/IC50
nM
koff
s-1
kon
M-1s-1
pHTemp
°C
Nitric oxide synthase, inducible
(Homo sapiens (Human))
BDBM50205924
(CHEMBL223384 | N-[(1,3-benzodioxol-5-yl)methyl]-1-...)
Show SMILES CNC(=O)N1CCN(C(CC(=O)NCc2ccc3OCOc3c2)C1)c1ccnc(n1)-n1ccnc1
Show InChI InChI=1S/C23H26N8O4/c1-24-23(33)29-8-9-31(20-4-5-26-22(28-20)30-7-6-25-14-30)17(13-29)11-21(32)27-12-16-2-3-18-19(10-16)35-15-34-18/h2-7,10,14,17H,8-9,11-13,15H2,1H3,(H,24,33)(H,27,32)
NCI pathway
Reactome pathway
n/an/a 1n/an/an/an/an/an/a
Berlex Biosciences
Curated by ChEMBL
Assay Description
Inhibition of cytokine-induced iNOS expressed in human A172 cells assessed as inhibition of NO formation
J Med Chem 50: 1146-57 (2007)
Article DOI: 10.1021/jm061319i
BindingDB Entry DOI: 10.7270/Q2SX6CWJ