BDBM50206501 9-(2'-O-octanoyl-beta-D-arabinofuranosyl)guanine::CHEMBL241793
SMILES: CCCCCCCC(=O)O[C@H]1[C@H](O)[C@@H](CO)O[C@H]1n1cnc2c1nc(N)[nH]c2=O
InChI Key: InChIKey=APHMYBFHRYMEFE-MJRMRKOOSA-N
Data: 6 IC50
Activity Spreadsheet -- Enzyme Inhibition Constant Data from BindingDB
Found 6 hits for monomerid = 50206501
Trg + Lig
Ki
nM
ΔG°
kcal/mole
IC50
nM
Kd
nM
EC50/IC50
nM
koff
s-1
kon
M-1s-1
pHTemp
°C
Diacylglycerol kinase 1
(Drosophila melanogaster)
BDBM50206501
(9-(2'-O-octanoyl-beta-D-arabinofuranosyl)guanine |...)
Show SMILES CCCCCCCC(=O)O[C@H]1[C@H](O)[C@@H](CO)O[C@H]1n1cnc2c1nc(N)[nH]c2=O
Show InChI InChI=1S/C18H27N5O6/c1-2-3-4-5-6-7-11(25)29-14-13(26)10(8-24)28-17(14)23-9-20-12-15(23)21-18(19)22-16(12)27/h9-10,13-14,17,24,26H,2-8H2,1H3,(H3,19,21,22,27)/t10-,13-,14+,17-/m1/s1
Reactome pathway
n/an/a>5.00E+5n/an/an/an/an/an/a
University of Ferrara
Curated by ChEMBL
Assay Description
Inhibition of Drosophila melanogaster dGK assessed as [methyl-3H]dThd phosphorylation
Bioorg Med Chem 15: 3065-81 (2007)
Article DOI: 10.1016/j.bmc.2007.01.049
BindingDB Entry DOI: 10.7270/Q29C6Z76
Thymidine kinase, mitochondrial
(Homo sapiens (Human))
BDBM50206501
(9-(2'-O-octanoyl-beta-D-arabinofuranosyl)guanine |...)
Show SMILES CCCCCCCC(=O)O[C@H]1[C@H](O)[C@@H](CO)O[C@H]1n1cnc2c1nc(N)[nH]c2=O
Show InChI InChI=1S/C18H27N5O6/c1-2-3-4-5-6-7-11(25)29-14-13(26)10(8-24)28-17(14)23-9-20-12-15(23)21-18(19)22-16(12)27/h9-10,13-14,17,24,26H,2-8H2,1H3,(H3,19,21,22,27)/t10-,13-,14+,17-/m1/s1
Reactome pathway
n/an/a>5.00E+5n/an/an/an/an/an/a
University of Ferrara
Curated by ChEMBL
Assay Description
Inhibition of human TK2 assessed as [methyl-3H]dThd phosphorylation
Bioorg Med Chem 15: 3065-81 (2007)
Article DOI: 10.1016/j.bmc.2007.01.049
BindingDB Entry DOI: 10.7270/Q29C6Z76
Thymidine kinase
(Varicella-zoster virus (strain Dumas) (HHV-3) (Hum...)
BDBM50206501
(9-(2'-O-octanoyl-beta-D-arabinofuranosyl)guanine |...)
Show SMILES CCCCCCCC(=O)O[C@H]1[C@H](O)[C@@H](CO)O[C@H]1n1cnc2c1nc(N)[nH]c2=O
Show InChI InChI=1S/C18H27N5O6/c1-2-3-4-5-6-7-11(25)29-14-13(26)10(8-24)28-17(14)23-9-20-12-15(23)21-18(19)22-16(12)27/h9-10,13-14,17,24,26H,2-8H2,1H3,(H3,19,21,22,27)/t10-,13-,14+,17-/m1/s1
n/an/a>5.00E+5n/an/an/an/an/an/a
University of Ferrara
Curated by ChEMBL
Assay Description
Inhibition of VZV TK assessed as [methyl-3H]dThd phosphorylation
Bioorg Med Chem 15: 3065-81 (2007)
Article DOI: 10.1016/j.bmc.2007.01.049
BindingDB Entry DOI: 10.7270/Q29C6Z76
Thymidine kinase
(Human herpesvirus 1 (strain SC16) (HHV-1) (Human h...)
BDBM50206501
(9-(2'-O-octanoyl-beta-D-arabinofuranosyl)guanine |...)
Show SMILES CCCCCCCC(=O)O[C@H]1[C@H](O)[C@@H](CO)O[C@H]1n1cnc2c1nc(N)[nH]c2=O
Show InChI InChI=1S/C18H27N5O6/c1-2-3-4-5-6-7-11(25)29-14-13(26)10(8-24)28-17(14)23-9-20-12-15(23)21-18(19)22-16(12)27/h9-10,13-14,17,24,26H,2-8H2,1H3,(H3,19,21,22,27)/t10-,13-,14+,17-/m1/s1
n/an/a>5.00E+5n/an/an/an/an/an/a
University of Ferrara
Curated by ChEMBL
Assay Description
Inhibition of HSV1 TK assessed as [methyl-3H]dThd phosphorylation
Bioorg Med Chem 15: 3065-81 (2007)
Article DOI: 10.1016/j.bmc.2007.01.049
BindingDB Entry DOI: 10.7270/Q29C6Z76
Deoxynucleoside kinase
(Drosophila melanogaster)
BDBM50206501
(9-(2'-O-octanoyl-beta-D-arabinofuranosyl)guanine |...)
Show SMILES CCCCCCCC(=O)O[C@H]1[C@H](O)[C@@H](CO)O[C@H]1n1cnc2c1nc(N)[nH]c2=O
Show InChI InChI=1S/C18H27N5O6/c1-2-3-4-5-6-7-11(25)29-14-13(26)10(8-24)28-17(14)23-9-20-12-15(23)21-18(19)22-16(12)27/h9-10,13-14,17,24,26H,2-8H2,1H3,(H3,19,21,22,27)/t10-,13-,14+,17-/m1/s1
Reactome pathway
n/an/a>5.00E+5n/an/an/an/an/an/a
University of Ferrara
Curated by ChEMBL
Assay Description
Inhibition of Drosophila melanogaster dNK assessed as [methyl-3H]dThd phosphorylation
Bioorg Med Chem 15: 3065-81 (2007)
Article DOI: 10.1016/j.bmc.2007.01.049
BindingDB Entry DOI: 10.7270/Q29C6Z76
Thymidine kinase, cytosolic
(Homo sapiens (Human))
BDBM50206501
(9-(2'-O-octanoyl-beta-D-arabinofuranosyl)guanine |...)
Show SMILES CCCCCCCC(=O)O[C@H]1[C@H](O)[C@@H](CO)O[C@H]1n1cnc2c1nc(N)[nH]c2=O
Show InChI InChI=1S/C18H27N5O6/c1-2-3-4-5-6-7-11(25)29-14-13(26)10(8-24)28-17(14)23-9-20-12-15(23)21-18(19)22-16(12)27/h9-10,13-14,17,24,26H,2-8H2,1H3,(H3,19,21,22,27)/t10-,13-,14+,17-/m1/s1
NCI pathway
Reactome pathway
n/an/a>5.00E+5n/an/an/an/an/an/a
University of Ferrara
Curated by ChEMBL
Assay Description
Inhibition of human TK1 assessed as [methyl-3H]dThd phosphorylation
Bioorg Med Chem 15: 3065-81 (2007)
Article DOI: 10.1016/j.bmc.2007.01.049
BindingDB Entry DOI: 10.7270/Q29C6Z76