BDBM50206663 (S)-3-(6-(4-chlorophenyl)-4-oxothieno[3,2-d]pyrimidin-3(4H)-yl)-N-methyl-N-((S)-1-(2-(tetrahydro-2H-pyran-4-yl)ethyl)pyrrolidin-3-yl)pyrrolidine-1-carboxamide::CHEMBL232823
SMILES: CN([C@H]1CCN(CCC2CCOCC2)C1)C(=O)N1CC[C@@H](C1)n1cnc2cc(sc2c1=O)-c1ccc(Cl)cc1
InChI Key: InChIKey=XPHYZINAPPVGJK-ZEQRLZLVSA-N
Data: 1 KI  1 IC50
Activity Spreadsheet -- Enzyme Inhibition Constant Data from BindingDB
Found 2 hits for monomerid = 50206663
Trg + Lig
Ki
nM
ΔG°
kcal/mole
IC50
nM
Kd
nM
EC50/IC50
nM
koff
s-1
kon
M-1s-1
pHTemp
°C
Melanin-concentrating hormone receptor
(Homo sapiens (Human))
BDBM50206663
((S)-3-(6-(4-chlorophenyl)-4-oxothieno[3,2-d]pyrimi...)
Show SMILES CN([C@H]1CCN(CCC2CCOCC2)C1)C(=O)N1CC[C@@H](C1)n1cnc2cc(sc2c1=O)-c1ccc(Cl)cc1
Show InChI InChI=1S/C29H36ClN5O3S/c1-32(23-7-12-33(17-23)11-6-20-9-14-38-15-10-20)29(37)34-13-8-24(18-34)35-19-31-25-16-26(39-27(25)28(35)36)21-2-4-22(30)5-3-21/h2-5,16,19-20,23-24H,6-15,17-18H2,1H3/t23-,24-/m0/s1
Reactome pathway
7n/an/an/an/an/an/an/an/a
Neurocrine Biosciences Inc.
Curated by ChEMBL
Assay Description
Binding affinity to human MCHR1
Bioorg Med Chem Lett 17: 2535-9 (2007)
Article DOI: 10.1016/j.bmcl.2007.02.012
BindingDB Entry DOI: 10.7270/Q23778CV
Melanin-concentrating hormone receptor
(Homo sapiens (Human))
BDBM50206663
((S)-3-(6-(4-chlorophenyl)-4-oxothieno[3,2-d]pyrimi...)
Show SMILES CN([C@H]1CCN(CCC2CCOCC2)C1)C(=O)N1CC[C@@H](C1)n1cnc2cc(sc2c1=O)-c1ccc(Cl)cc1
Show InChI InChI=1S/C29H36ClN5O3S/c1-32(23-7-12-33(17-23)11-6-20-9-14-38-15-10-20)29(37)34-13-8-24(18-34)35-19-31-25-16-26(39-27(25)28(35)36)21-2-4-22(30)5-3-21/h2-5,16,19-20,23-24H,6-15,17-18H2,1H3/t23-,24-/m0/s1
Reactome pathway
n/an/a 11n/an/an/an/an/an/a
Neurocrine Biosciences Inc.
Curated by ChEMBL
Assay Description
Antagonist activity at human MCHR1 by [35S]GTPgammaS binding assay
Bioorg Med Chem Lett 17: 2535-9 (2007)
Article DOI: 10.1016/j.bmcl.2007.02.012
BindingDB Entry DOI: 10.7270/Q23778CV