BDBM50206670 (S)-3-(6-(4-chlorophenyl)-4-oxothieno[3,2-d]pyrimidin-3(4H)-yl)-N-methyl-N-((S)-1-methylpyrrolidin-3-yl)pyrrolidine-1-carboxamide::CHEMBL394823
SMILES: CN([C@H]1CCN(C)C1)C(=O)N1CC[C@@H](C1)n1cnc2cc(sc2c1=O)-c1ccc(Cl)cc1
InChI Key: InChIKey=JBZGTCHTLDTIHZ-ROUUACIJSA-N
Data: 1 KI  1 IC50
Activity Spreadsheet -- Enzyme Inhibition Constant Data from BindingDB
Found 2 hits for monomerid = 50206670
Trg + Lig
Ki
nM
ΔG°
kcal/mole
IC50
nM
Kd
nM
EC50/IC50
nM
koff
s-1
kon
M-1s-1
pHTemp
°C
Melanin-concentrating hormone receptor
(Homo sapiens (Human))
BDBM50206670
((S)-3-(6-(4-chlorophenyl)-4-oxothieno[3,2-d]pyrimi...)
Show SMILES CN([C@H]1CCN(C)C1)C(=O)N1CC[C@@H](C1)n1cnc2cc(sc2c1=O)-c1ccc(Cl)cc1
Show InChI InChI=1S/C23H26ClN5O2S/c1-26-9-7-17(12-26)27(2)23(31)28-10-8-18(13-28)29-14-25-19-11-20(32-21(19)22(29)30)15-3-5-16(24)6-4-15/h3-6,11,14,17-18H,7-10,12-13H2,1-2H3/t17-,18-/m0/s1
Reactome pathway
10n/an/an/an/an/an/an/an/a
Neurocrine Biosciences Inc.
Curated by ChEMBL
Assay Description
Binding affinity to human MCHR1
Bioorg Med Chem Lett 17: 2535-9 (2007)
Article DOI: 10.1016/j.bmcl.2007.02.012
BindingDB Entry DOI: 10.7270/Q23778CV
Melanin-concentrating hormone receptor
(Homo sapiens (Human))
BDBM50206670
((S)-3-(6-(4-chlorophenyl)-4-oxothieno[3,2-d]pyrimi...)
Show SMILES CN([C@H]1CCN(C)C1)C(=O)N1CC[C@@H](C1)n1cnc2cc(sc2c1=O)-c1ccc(Cl)cc1
Show InChI InChI=1S/C23H26ClN5O2S/c1-26-9-7-17(12-26)27(2)23(31)28-10-8-18(13-28)29-14-25-19-11-20(32-21(19)22(29)30)15-3-5-16(24)6-4-15/h3-6,11,14,17-18H,7-10,12-13H2,1-2H3/t17-,18-/m0/s1
Reactome pathway
n/an/a 20n/an/an/an/an/an/a
Neurocrine Biosciences Inc.
Curated by ChEMBL
Assay Description
Antagonist activity at human MCHR1 by [35S]GTPgammaS binding assay
Bioorg Med Chem Lett 17: 2535-9 (2007)
Article DOI: 10.1016/j.bmcl.2007.02.012
BindingDB Entry DOI: 10.7270/Q23778CV