BDBM50206675 (S)-3-(6-(4-chlorophenyl)-4-oxothieno[3,2-d]pyrimidin-3(4H)-yl)-N-((S)-1-(4,4-dimethylcyclohexyl)pyrrolidin-3-yl)-N-methylpyrrolidine-1-carboxamide::CHEMBL232858
SMILES: CN([C@H]1CCN(C1)C1CCC(C)(C)CC1)C(=O)N1CC[C@@H](C1)n1cnc2cc(sc2c1=O)-c1ccc(Cl)cc1
InChI Key: InChIKey=INEACRKPYDPVAY-ZEQRLZLVSA-N
Data: 1 KI  2 IC50
Activity Spreadsheet -- Enzyme Inhibition Constant Data from BindingDB
Found 3 hits for monomerid = 50206675
Trg + Lig
Ki
nM
ΔG°
kcal/mole
IC50
nM
Kd
nM
EC50/IC50
nM
koff
s-1
kon
M-1s-1
pHTemp
°C
Melanin-concentrating hormone receptor
(Homo sapiens (Human))
BDBM50206675
((S)-3-(6-(4-chlorophenyl)-4-oxothieno[3,2-d]pyrimi...)
Show SMILES CN([C@H]1CCN(C1)C1CCC(C)(C)CC1)C(=O)N1CC[C@@H](C1)n1cnc2cc(sc2c1=O)-c1ccc(Cl)cc1
Show InChI InChI=1S/C30H38ClN5O2S/c1-30(2)12-8-22(9-13-30)34-14-10-23(17-34)33(3)29(38)35-15-11-24(18-35)36-19-32-25-16-26(39-27(25)28(36)37)20-4-6-21(31)7-5-20/h4-7,16,19,22-24H,8-15,17-18H2,1-3H3/t23-,24-/m0/s1
Reactome pathway
2n/an/an/an/an/an/an/an/a
Neurocrine Biosciences Inc.
Curated by ChEMBL
Assay Description
Binding affinity to human MCHR1
Bioorg Med Chem Lett 17: 2535-9 (2007)
Article DOI: 10.1016/j.bmcl.2007.02.012
BindingDB Entry DOI: 10.7270/Q23778CV
Cytochrome P450 2D6
(Homo sapiens (Human))
BDBM50206675
((S)-3-(6-(4-chlorophenyl)-4-oxothieno[3,2-d]pyrimi...)
Show SMILES CN([C@H]1CCN(C1)C1CCC(C)(C)CC1)C(=O)N1CC[C@@H](C1)n1cnc2cc(sc2c1=O)-c1ccc(Cl)cc1
Show InChI InChI=1S/C30H38ClN5O2S/c1-30(2)12-8-22(9-13-30)34-14-10-23(17-34)33(3)29(38)35-15-11-24(18-35)36-19-32-25-16-26(39-27(25)28(36)37)20-4-6-21(31)7-5-20/h4-7,16,19,22-24H,8-15,17-18H2,1-3H3/t23-,24-/m0/s1
n/an/a 3.40E+3n/an/an/an/an/an/a
Neurocrine Biosciences Inc.
Curated by ChEMBL
Assay Description
Inhibition of CYP2D6
Bioorg Med Chem Lett 17: 2535-9 (2007)
Article DOI: 10.1016/j.bmcl.2007.02.012
BindingDB Entry DOI: 10.7270/Q23778CV
Melanin-concentrating hormone receptor
(Homo sapiens (Human))
BDBM50206675
((S)-3-(6-(4-chlorophenyl)-4-oxothieno[3,2-d]pyrimi...)
Show SMILES CN([C@H]1CCN(C1)C1CCC(C)(C)CC1)C(=O)N1CC[C@@H](C1)n1cnc2cc(sc2c1=O)-c1ccc(Cl)cc1
Show InChI InChI=1S/C30H38ClN5O2S/c1-30(2)12-8-22(9-13-30)34-14-10-23(17-34)33(3)29(38)35-15-11-24(18-35)36-19-32-25-16-26(39-27(25)28(36)37)20-4-6-21(31)7-5-20/h4-7,16,19,22-24H,8-15,17-18H2,1-3H3/t23-,24-/m0/s1
Reactome pathway
n/an/a 10n/an/an/an/an/an/a
Neurocrine Biosciences Inc.
Curated by ChEMBL
Assay Description
Antagonist activity at human MCHR1 by [35S]GTPgammaS binding assay
Bioorg Med Chem Lett 17: 2535-9 (2007)
Article DOI: 10.1016/j.bmcl.2007.02.012
BindingDB Entry DOI: 10.7270/Q23778CV