BDBM50206901 CHEMBL3894105
SMILES: [H][C@@]12CC[C@@](O)(C#CC)[C@@]1(C)CC=C1c3ccc(cc3CC[C@@]21[H])C(=O)Nc1cccnc1C
InChI Key: InChIKey=QZJGYVBMHZKQSK-JGPKDBRGSA-N
Data: 1 EC50
Activity Spreadsheet -- Enzyme Inhibition Constant Data from BindingDB
Found 1 hit for monomerid = 50206901
Trg + Lig
Ki
nM
ΔG°
kcal/mole
IC50
nM
Kd
nM
EC50/IC50
nM
koff
s-1
kon
M-1s-1
pHTemp
°C
Glucocorticoid receptor
(Homo sapiens (Human))
BDBM50206901
(CHEMBL3894105)
Show SMILES [H][C@@]12CC[C@@](O)(C#CC)[C@@]1(C)CC=C1c3ccc(cc3CC[C@@]21[H])C(=O)Nc1cccnc1C |r,t:13|
Show InChI InChI=1S/C28H30N2O2/c1-4-13-28(32)15-12-24-23-10-7-19-17-20(26(31)30-25-6-5-16-29-18(25)2)8-9-21(19)22(23)11-14-27(24,28)3/h5-6,8-9,11,16-17,23-24,32H,7,10,12,14-15H2,1-3H3,(H,30,31)/t23-,24+,27+,28+/m1/s1
n/an/an/an/a 1.86E+3n/an/an/an/a
The Scripps Research Institute
Curated by ChEMBL
Assay Description
Agonist activity at GR in human HepG2 cells assessed as protein mediated-transcriptional activity by MMTV-promoter driven luciferase reporter gene as...
Bioorg Med Chem Lett 27: 347-353 (2017)
Article DOI: 10.1016/j.bmcl.2016.11.007
BindingDB Entry DOI: 10.7270/Q24B339Q