BDBM50207121 CHEMBL245648::N-(4-((8-((6,7-dimethoxyisoquinolin-4-yl)methyl)-1-methyl-2,6-dioxo-1,6-dihydro-2H-purin-3(7H)-yl)methyl)phenyl)propane-2-sulfonamide
SMILES: COc1cc2cncc(Cc3nc4n(Cc5ccc(NS(=O)(=O)C(C)C)cc5)c(=O)n(C)c(=O)c4[nH]3)c2cc1OC
InChI Key: InChIKey=WBRMBHGVOUPISJ-UHFFFAOYSA-N
Data: 1 IC50
Activity Spreadsheet -- Enzyme Inhibition Constant Data from BindingDB
Found 1 hit for monomerid = 50207121
Trg + Lig
Ki
nM
ΔG°
kcal/mole
IC50
nM
Kd
nM
EC50/IC50
nM
koff
s-1
kon
M-1s-1
pHTemp
°C
cGMP-specific 3',5'-cyclic phosphodiesterase
(Homo sapiens (Human))
BDBM50207121
(CHEMBL245648 | N-(4-((8-((6,7-dimethoxyisoquinolin...)
Show SMILES COc1cc2cncc(Cc3nc4n(Cc5ccc(NS(=O)(=O)C(C)C)cc5)c(=O)n(C)c(=O)c4[nH]3)c2cc1OC
Show InChI InChI=1S/C28H30N6O6S/c1-16(2)41(37,38)32-20-8-6-17(7-9-20)15-34-26-25(27(35)33(3)28(34)36)30-24(31-26)11-19-14-29-13-18-10-22(39-4)23(40-5)12-21(18)19/h6-10,12-14,16,32H,11,15H2,1-5H3,(H,30,31)
Reactome pathway
n/an/a 5n/an/an/an/an/an/a
Novartis Institutes of Biomedical Research
Curated by ChEMBL
Assay Description
Inhibition of human platelet PDE5 by [3H]cGMP scintillation proximity assay
Bioorg Med Chem Lett 17: 2376-9 (2007)
Article DOI: 10.1016/j.bmcl.2006.11.019
BindingDB Entry DOI: 10.7270/Q2X63NSC