BDBM50207238 THIOHYDANTOIN::Thiohydantoin
SMILES: O=C1CNC(=S)N1
InChI Key: InChIKey=UGWULZWUXSCWPX-UHFFFAOYSA-N
Data: 1 KI
Activity Spreadsheet -- Enzyme Inhibition Constant Data from BindingDB
Found 3 hits for monomerid = 50207238
Trg + Lig
Ki
nM
ΔG°
kcal/mole
IC50
nM
Kd
nM
EC50/IC50
nM
koff
s-1
kon
M-1s-1
pHTemp
°C
Glycogen phosphorylase, muscle form
(Oryctolagus cuniculus (rabbit))
BDBM50207238
(THIOHYDANTOIN | Thiohydantoin)
Show SMILES O=C1CNC(=S)N1
Show InChI InChI=1S/C3H4N2OS/c6-2-1-4-3(7)5-2/h1H2,(H2,4,5,6,7)
5.10E+3n/an/an/an/an/an/an/an/a
University of Thessaly
Curated by ChEMBL
Assay Description
Competitive inhibition of rabbit muscle glycogen phosphorylase-b in presence of varying glucose-1-phosphate levels and NADP
Eur J Med Chem 123: 737-745 (2016)
Article DOI: 10.1016/j.ejmech.2016.06.049
BindingDB Entry DOI: 10.7270/Q2TT4SXG
Protein cereblon
(Homo sapiens (Human))
BDBM50207238
(THIOHYDANTOIN | Thiohydantoin)
Show SMILES O=C1CNC(=S)N1
Show InChI InChI=1S/C3H4N2OS/c6-2-1-4-3(7)5-2/h1H2,(H2,4,5,6,7)
1.69E+5n/an/an/an/an/an/an/an/a
TBA
Citation and Details
Protein cereblon
(Homo sapiens (Human))
BDBM50207238
(THIOHYDANTOIN | Thiohydantoin)
Show SMILES O=C1CNC(=S)N1
Show InChI InChI=1S/C3H4N2OS/c6-2-1-4-3(7)5-2/h1H2,(H2,4,5,6,7)
n/an/a 3.32E+5n/an/an/an/an/an/a
TBA
Citation and Details