null
SMILES: CC1(C)Cc2c(O1)c(cc1nc(Nc3c(F)cccc3Cl)[nH]c21)C(=O)Nc1ccc(cc1)C(F)(F)F
InChI Key: InChIKey=SMUHRFNGPGEYHA-UHFFFAOYSA-N
Activity Spreadsheet -- Enzyme Inhibition Constant Data from BindingDB
Found 6 hits for monomerid = 50207343
Trg + Lig
Ki
nM
ΔG°
kcal/mole
IC50
nM
Kd
nM
EC50/IC50
nM
koff
s-1
kon
M-1s-1
pHTemp
°C
Prostaglandin E synthase
(Homo sapiens (Human))
BDBM50207343
(CHEMBL3931344)
Show SMILES CC1(C)Cc2c(O1)c(cc1nc(Nc3c(F)cccc3Cl)[nH]c21)C(=O)Nc1ccc(cc1)C(F)(F)F
Show InChI InChI=1S/C25H19ClF4N4O2/c1-24(2)11-15-19-18(32-23(33-19)34-20-16(26)4-3-5-17(20)27)10-14(21(15)36-24)22(35)31-13-8-6-12(7-9-13)25(28,29)30/h3-10H,11H2,1-2H3,(H,31,35)(H2,32,33,34)
Reactome pathway
n/an/a 3.90n/an/an/an/an/an/a
Glenmark Pharmaceuticals Limited
Curated by ChEMBL
Assay Description
Inhibition of human recombinant mPGES-1 expressed in CHO cells assessed as reduction in conversion of PGH2 to PGE2 incubated for 10 mins followed by ...
Bioorg Med Chem Lett 26: 5977-5984 (2016)
Article DOI: 10.1016/j.bmcl.2016.10.079
BindingDB Entry DOI: 10.7270/Q2XK8HJ8
Prostaglandin E synthase
(Homo sapiens (Human))
BDBM50207343
(CHEMBL3931344)
Show SMILES CC1(C)Cc2c(O1)c(cc1nc(Nc3c(F)cccc3Cl)[nH]c21)C(=O)Nc1ccc(cc1)C(F)(F)F
Show InChI InChI=1S/C25H19ClF4N4O2/c1-24(2)11-15-19-18(32-23(33-19)34-20-16(26)4-3-5-17(20)27)10-14(21(15)36-24)22(35)31-13-8-6-12(7-9-13)25(28,29)30/h3-10H,11H2,1-2H3,(H,31,35)(H2,32,33,34)
Reactome pathway
n/an/a 3.90n/an/an/an/an/an/a
Glenmark Pharmaceuticals Limited
Curated by ChEMBL
Assay Description
Inhibition of recombinant human mPGES1 expressed in CHO cells using PGH2 as substrate pretreated for 10 mins followed by substrate addition measured ...
Bioorg Med Chem Lett 27: 5131-5138 (2017)
Article DOI: 10.1016/j.bmcl.2017.10.062
BindingDB Entry DOI: 10.7270/Q2JS9T0V
Prostaglandin E synthase
(Homo sapiens (Human))
BDBM50207343
(CHEMBL3931344)
Show SMILES CC1(C)Cc2c(O1)c(cc1nc(Nc3c(F)cccc3Cl)[nH]c21)C(=O)Nc1ccc(cc1)C(F)(F)F
Show InChI InChI=1S/C25H19ClF4N4O2/c1-24(2)11-15-19-18(32-23(33-19)34-20-16(26)4-3-5-17(20)27)10-14(21(15)36-24)22(35)31-13-8-6-12(7-9-13)25(28,29)30/h3-10H,11H2,1-2H3,(H,31,35)(H2,32,33,34)
Reactome pathway
n/an/a 10n/an/an/an/an/an/a
Glenmark Pharmaceuticals Limited
Curated by ChEMBL
Assay Description
Inhibition of mPGES1 in human A549 cells assessed as reduction in IL-1beta induced PGE2 production pretreated for 30 mins followed by IL-1beta additi...
Bioorg Med Chem Lett 27: 5131-5138 (2017)
Article DOI: 10.1016/j.bmcl.2017.10.062
BindingDB Entry DOI: 10.7270/Q2JS9T0V
Polyunsaturated fatty acid 5-lipoxygenase
(Homo sapiens (Human))
BDBM50207343
(CHEMBL3931344)
Show SMILES CC1(C)Cc2c(O1)c(cc1nc(Nc3c(F)cccc3Cl)[nH]c21)C(=O)Nc1ccc(cc1)C(F)(F)F
Show InChI InChI=1S/C25H19ClF4N4O2/c1-24(2)11-15-19-18(32-23(33-19)34-20-16(26)4-3-5-17(20)27)10-14(21(15)36-24)22(35)31-13-8-6-12(7-9-13)25(28,29)30/h3-10H,11H2,1-2H3,(H,31,35)(H2,32,33,34)
Reactome pathway
n/an/a 6.10E+3n/an/an/an/an/an/a
Glenmark Pharmaceuticals Limited
Curated by ChEMBL
Assay Description
Inhibition of recombinant human 5-LO expressed in Sf9 cells using arachidonic acid as substrate by rhodamine123 based fluorescence assay
Bioorg Med Chem Lett 27: 5131-5138 (2017)
Article DOI: 10.1016/j.bmcl.2017.10.062
BindingDB Entry DOI: 10.7270/Q2JS9T0V
Translocator protein
(Rattus norvegicus (rat))
BDBM50207343
(CHEMBL3931344)
Show SMILES CC1(C)Cc2c(O1)c(cc1nc(Nc3c(F)cccc3Cl)[nH]c21)C(=O)Nc1ccc(cc1)C(F)(F)F
Show InChI InChI=1S/C25H19ClF4N4O2/c1-24(2)11-15-19-18(32-23(33-19)34-20-16(26)4-3-5-17(20)27)10-14(21(15)36-24)22(35)31-13-8-6-12(7-9-13)25(28,29)30/h3-10H,11H2,1-2H3,(H,31,35)(H2,32,33,34)
n/an/a 110n/an/an/an/an/an/a
Glenmark Pharmaceuticals Limited
Curated by ChEMBL
Assay Description
Displacement of [3H]PK 11195 from rat heart peripheral-type benzodiazepine receptor
Bioorg Med Chem Lett 27: 5131-5138 (2017)
Article DOI: 10.1016/j.bmcl.2017.10.062
BindingDB Entry DOI: 10.7270/Q2JS9T0V
Prostaglandin E synthase
(Homo sapiens (Human))
BDBM50207343
(CHEMBL3931344)
Show SMILES CC1(C)Cc2c(O1)c(cc1nc(Nc3c(F)cccc3Cl)[nH]c21)C(=O)Nc1ccc(cc1)C(F)(F)F
Show InChI InChI=1S/C25H19ClF4N4O2/c1-24(2)11-15-19-18(32-23(33-19)34-20-16(26)4-3-5-17(20)27)10-14(21(15)36-24)22(35)31-13-8-6-12(7-9-13)25(28,29)30/h3-10H,11H2,1-2H3,(H,31,35)(H2,32,33,34)
Reactome pathway
n/an/a 275n/an/an/an/an/an/a
Glenmark Pharmaceuticals Limited
Curated by ChEMBL
Assay Description
Inhibition of mPGES1 in human whole blood assessed as inhibition of LPS-induced PGE2 production measured after 20 to 24 hrs
Bioorg Med Chem Lett 27: 5131-5138 (2017)
Article DOI: 10.1016/j.bmcl.2017.10.062
BindingDB Entry DOI: 10.7270/Q2JS9T0V