null
SMILES: CCS(=O)(=O)N1CCCCC(=O)N2CCc3cc(Nc4ncc(c(NCc5ccccc15)n4)C(F)(F)F)ccc23
InChI Key: InChIKey=WFYYQQDXEBYUGQ-UHFFFAOYSA-N
Activity Spreadsheet -- Enzyme Inhibition Constant Data from BindingDB
Found 2 hits for monomerid = 50207352
Trg + Lig
Ki
nM
ΔG°
kcal/mole
IC50
nM
Kd
nM
EC50/IC50
nM
koff
s-1
kon
M-1s-1
pHTemp
°C
Protein-tyrosine kinase 2-beta
(Homo sapiens (Human))
BDBM50207352
(CHEMBL3908093)
Show SMILES CCS(=O)(=O)N1CCCCC(=O)N2CCc3cc(Nc4ncc(c(NCc5ccccc15)n4)C(F)(F)F)ccc23
Show InChI InChI=1S/C27H29F3N6O3S/c1-2-40(38,39)36-13-6-5-9-24(37)35-14-12-18-15-20(10-11-22(18)35)33-26-32-17-21(27(28,29)30)25(34-26)31-16-19-7-3-4-8-23(19)36/h3-4,7-8,10-11,15,17H,2,5-6,9,12-14,16H2,1H3,(H2,31,32,33,34)
n/an/a 1.90n/an/an/an/an/an/a
Gilead Sciences, Inc.
Curated by ChEMBL
Assay Description
Inhibition of full length recombinant human N-terminal His6-tagged PYK2 expressed in baculovirus infected sf21 cells
Bioorg Med Chem Lett 26: 5926-5930 (2016)
Article DOI: 10.1016/j.bmcl.2016.10.092
BindingDB Entry DOI: 10.7270/Q2ST7RTJ
Focal adhesion kinase 1
(Homo sapiens (Human))
BDBM50207352
(CHEMBL3908093)
Show SMILES CCS(=O)(=O)N1CCCCC(=O)N2CCc3cc(Nc4ncc(c(NCc5ccccc15)n4)C(F)(F)F)ccc23
Show InChI InChI=1S/C27H29F3N6O3S/c1-2-40(38,39)36-13-6-5-9-24(37)35-14-12-18-15-20(10-11-22(18)35)33-26-32-17-21(27(28,29)30)25(34-26)31-16-19-7-3-4-8-23(19)36/h3-4,7-8,10-11,15,17H,2,5-6,9,12-14,16H2,1H3,(H2,31,32,33,34)
NCI pathway
Reactome pathway
n/an/a 9.20n/an/an/an/an/an/a
Gilead Sciences, Inc.
Curated by ChEMBL
Assay Description
Inhibition of NH2-terminal His6-tagged FAK kinase domain (410 to 689 residues) (unknown origin) expressed in baculovirus infected sf9 cells using p(G...
Bioorg Med Chem Lett 26: 5926-5930 (2016)
Article DOI: 10.1016/j.bmcl.2016.10.092
BindingDB Entry DOI: 10.7270/Q2ST7RTJ