null
SMILES: [#8]-[#6](=O)-[#6]-c1cccc(-[#8]-[#6]\[#6]=[#6](/c2ccc(Br)cc2)-c2ccc(Br)cc2)c1
InChI Key: InChIKey=XTKJJTSBXITZND-UHFFFAOYSA-N
Activity Spreadsheet -- Enzyme Inhibition Constant Data from BindingDB
Found 3 hits for monomerid = 50207467
Trg + Lig
Ki
nM
ΔG°
kcal/mole
IC50
nM
Kd
nM
EC50/IC50
nM
koff
s-1
kon
M-1s-1
pHTemp
°C
Peroxisome proliferator-activated receptor delta
(Homo sapiens (Human))
BDBM50207467
(3-{3-[3,3-bis-(4-bromo-phenyl)-allyloxy]-phenyl}-a...)
Show SMILES [#8]-[#6](=O)-[#6]-c1cccc(-[#8]-[#6]\[#6]=[#6](/c2ccc(Br)cc2)-c2ccc(Br)cc2)c1
Show InChI InChI=1S/C23H18Br2O3/c24-19-8-4-17(5-9-19)22(18-6-10-20(25)11-7-18)12-13-28-21-3-1-2-16(14-21)15-23(26)27/h1-12,14H,13,15H2,(H,26,27)
n/an/an/an/a 830n/an/an/an/a
Novo Nordisk A/S
Curated by ChEMBL
Assay Description
Activity at human placenta PPAR delta expressed in HEK293 cells by PPAR-GAL4 transactivation assay
J Med Chem 50: 1495-503 (2007)
Article DOI: 10.1021/jm061202u
BindingDB Entry DOI: 10.7270/Q2J9662B
Peroxisome proliferator-activated receptor alpha
(Homo sapiens (Human))
BDBM50207467
(3-{3-[3,3-bis-(4-bromo-phenyl)-allyloxy]-phenyl}-a...)
Show SMILES [#8]-[#6](=O)-[#6]-c1cccc(-[#8]-[#6]\[#6]=[#6](/c2ccc(Br)cc2)-c2ccc(Br)cc2)c1
Show InChI InChI=1S/C23H18Br2O3/c24-19-8-4-17(5-9-19)22(18-6-10-20(25)11-7-18)12-13-28-21-3-1-2-16(14-21)15-23(26)27/h1-12,14H,13,15H2,(H,26,27)
n/an/an/an/a>1.00E+4n/an/an/an/a
Novo Nordisk A/S
Curated by ChEMBL
Assay Description
Activity at human liver PPAR alpha expressed in HEK293 cells by PPAR-GAL4 transactivation assay
J Med Chem 50: 1495-503 (2007)
Article DOI: 10.1021/jm061202u
BindingDB Entry DOI: 10.7270/Q2J9662B
Peroxisome proliferator-activated receptor gamma
(Homo sapiens (Human))
BDBM50207467
(3-{3-[3,3-bis-(4-bromo-phenyl)-allyloxy]-phenyl}-a...)
Show SMILES [#8]-[#6](=O)-[#6]-c1cccc(-[#8]-[#6]\[#6]=[#6](/c2ccc(Br)cc2)-c2ccc(Br)cc2)c1
Show InChI InChI=1S/C23H18Br2O3/c24-19-8-4-17(5-9-19)22(18-6-10-20(25)11-7-18)12-13-28-21-3-1-2-16(14-21)15-23(26)27/h1-12,14H,13,15H2,(H,26,27)
NCI pathway
Reactome pathway
n/an/an/an/a>1.00E+4n/an/an/an/a
Novo Nordisk A/S
Curated by ChEMBL
Assay Description
Activity at human adipose tissue PPAR gamma expressed in HEK293 cells by PPAR-GAL4 transactivation assay
J Med Chem 50: 1495-503 (2007)
Article DOI: 10.1021/jm061202u
BindingDB Entry DOI: 10.7270/Q2J9662B