null
SMILES: Oc1csc(=O)n1CCCOc1ccc(CN2CCC(CC2)NC(=O)c2cc(=O)c3ccc(F)cc3o2)cc1F
InChI Key: InChIKey=HCWVVEJZWMDPGG-UHFFFAOYSA-N
Activity Spreadsheet -- Enzyme Inhibition Constant Data from BindingDB
Found 3 hits for monomerid = 50207674
Trg + Lig
Ki
nM
ΔG°
kcal/mole
IC50
nM
Kd
nM
EC50/IC50
nM
koff
s-1
kon
M-1s-1
pHTemp
°C
Melanin-concentrating hormone receptor 1
(Homo sapiens (Human))
BDBM50207674
(CHEMBL245844 | N-(1-(4-(3-(2,4-dioxothiazolidin-3-...)
Show SMILES Oc1csc(=O)n1CCCOc1ccc(CN2CCC(CC2)NC(=O)c2cc(=O)c3ccc(F)cc3o2)cc1F
Show InChI InChI=1S/C28H27F2N3O6S/c29-18-3-4-20-22(34)14-25(39-24(20)13-18)27(36)31-19-6-9-32(10-7-19)15-17-2-5-23(21(30)12-17)38-11-1-8-33-26(35)16-40-28(33)37/h2-5,12-14,16,19,35H,1,6-11,15H2,(H,31,36)
Reactome pathway
n/an/a 4n/an/an/an/an/an/a
Abbott Laboratories
Curated by ChEMBL
Assay Description
Displacement of [125I]MCH from MCHR1 expressed in IMR32 cells
Bioorg Med Chem Lett 17: 2365-71 (2007)
Article DOI: 10.1016/j.bmcl.2006.11.068
BindingDB Entry DOI: 10.7270/Q2N29WNW
Potassium voltage-gated channel subfamily H member 2
(Homo sapiens (Human))
BDBM50207674
(CHEMBL245844 | N-(1-(4-(3-(2,4-dioxothiazolidin-3-...)
Show SMILES Oc1csc(=O)n1CCCOc1ccc(CN2CCC(CC2)NC(=O)c2cc(=O)c3ccc(F)cc3o2)cc1F
Show InChI InChI=1S/C28H27F2N3O6S/c29-18-3-4-20-22(34)14-25(39-24(20)13-18)27(36)31-19-6-9-32(10-7-19)15-17-2-5-23(21(30)12-17)38-11-1-8-33-26(35)16-40-28(33)37/h2-5,12-14,16,19,35H,1,6-11,15H2,(H,31,36)
Reactome pathway
n/an/a 8.50E+3n/an/an/an/an/an/a
Abbott Laboratories
Curated by ChEMBL
Assay Description
Displacement of [3H]dofetilide from hERG expressed in HEK293 cell membrane
Bioorg Med Chem Lett 17: 2365-71 (2007)
Article DOI: 10.1016/j.bmcl.2006.11.068
BindingDB Entry DOI: 10.7270/Q2N29WNW
Melanin-concentrating hormone receptor 1
(Homo sapiens (Human))
BDBM50207674
(CHEMBL245844 | N-(1-(4-(3-(2,4-dioxothiazolidin-3-...)
Show SMILES Oc1csc(=O)n1CCCOc1ccc(CN2CCC(CC2)NC(=O)c2cc(=O)c3ccc(F)cc3o2)cc1F
Show InChI InChI=1S/C28H27F2N3O6S/c29-18-3-4-20-22(34)14-25(39-24(20)13-18)27(36)31-19-6-9-32(10-7-19)15-17-2-5-23(21(30)12-17)38-11-1-8-33-26(35)16-40-28(33)37/h2-5,12-14,16,19,35H,1,6-11,15H2,(H,31,36)
Reactome pathway
n/an/a 545n/an/an/an/an/an/a
Abbott Laboratories
Curated by ChEMBL
Assay Description
Antagonist activity at MCHR1 assessed as inhibition of MCH-mediated calcium release in IMR32 cells
Bioorg Med Chem Lett 17: 2365-71 (2007)
Article DOI: 10.1016/j.bmcl.2006.11.068
BindingDB Entry DOI: 10.7270/Q2N29WNW