BDBM50207856 3-isopropyl-N-(4-methyl-3-(3-(2-(methylamino)pyridin-4-yl)pyridin-2-yloxy)phenyl)benzamide::CHEMBL245947
SMILES: CNc1cc(ccn1)-c1cccnc1Oc1cc(NC(=O)c2cccc(c2)C(C)C)ccc1C
InChI Key: InChIKey=VWYXMUBOMREMIL-UHFFFAOYSA-N
Data: 3 IC50
Activity Spreadsheet -- Enzyme Inhibition Constant Data from BindingDB
Found 3 hits for monomerid = 50207856
Trg + Lig
Ki
nM
ΔG°
kcal/mole
IC50
nM
Kd
nM
EC50/IC50
nM
koff
s-1
kon
M-1s-1
pHTemp
°C
Vascular endothelial growth factor receptor 2
(Homo sapiens (Human))
BDBM50207856
(3-isopropyl-N-(4-methyl-3-(3-(2-(methylamino)pyrid...)
Show SMILES CNc1cc(ccn1)-c1cccnc1Oc1cc(NC(=O)c2cccc(c2)C(C)C)ccc1C
Show InChI InChI=1S/C28H28N4O2/c1-18(2)20-7-5-8-22(15-20)27(33)32-23-11-10-19(3)25(17-23)34-28-24(9-6-13-31-28)21-12-14-30-26(16-21)29-4/h5-18H,1-4H3,(H,29,30)(H,32,33)
NCI pathway
Reactome pathway
n/an/a 18n/an/an/an/an/an/a
Amgen Inc.
Curated by ChEMBL
Assay Description
Inhibition of KDR after 90 mins by HTRF assay
Bioorg Med Chem Lett 17: 2886-9 (2007)
Article DOI: 10.1016/j.bmcl.2007.02.067
BindingDB Entry DOI: 10.7270/Q2445M4C
Angiopoietin-1 receptor
(Homo sapiens (Human))
BDBM50207856
(3-isopropyl-N-(4-methyl-3-(3-(2-(methylamino)pyrid...)
Show SMILES CNc1cc(ccn1)-c1cccnc1Oc1cc(NC(=O)c2cccc(c2)C(C)C)ccc1C
Show InChI InChI=1S/C28H28N4O2/c1-18(2)20-7-5-8-22(15-20)27(33)32-23-11-10-19(3)25(17-23)34-28-24(9-6-13-31-28)21-12-14-30-26(16-21)29-4/h5-18H,1-4H3,(H,29,30)(H,32,33)
n/an/a 1n/an/an/an/an/an/a
Amgen Inc.
Curated by ChEMBL
Assay Description
Inhibition of Tie2 after 90 mins by HTRF assay
Bioorg Med Chem Lett 17: 2886-9 (2007)
Article DOI: 10.1016/j.bmcl.2007.02.067
BindingDB Entry DOI: 10.7270/Q2445M4C
Angiopoietin-1 receptor
(Homo sapiens (Human))
BDBM50207856
(3-isopropyl-N-(4-methyl-3-(3-(2-(methylamino)pyrid...)
Show SMILES CNc1cc(ccn1)-c1cccnc1Oc1cc(NC(=O)c2cccc(c2)C(C)C)ccc1C
Show InChI InChI=1S/C28H28N4O2/c1-18(2)20-7-5-8-22(15-20)27(33)32-23-11-10-19(3)25(17-23)34-28-24(9-6-13-31-28)21-12-14-30-26(16-21)29-4/h5-18H,1-4H3,(H,29,30)(H,32,33)
n/an/a 11n/an/an/an/an/an/a
Amgen Inc.
Curated by ChEMBL
Assay Description
Inhibition of Tie2 autophosphorylation in EA.hy926 cells after 2.5 hrs
Bioorg Med Chem Lett 17: 2886-9 (2007)
Article DOI: 10.1016/j.bmcl.2007.02.067
BindingDB Entry DOI: 10.7270/Q2445M4C