BDBM50208134 5-methyl-5-(4-methyl-thiophen-2-yl)-4-oxo-4,5-dihydro-furan-2-carboxylic acid::CHEMBL223623
SMILES: Cc1csc(c1)C1(C)OC(=CC1=O)C(O)=O
InChI Key: InChIKey=IGVRQQOEOAUGSS-UHFFFAOYSA-N
Data: 2 EC50
Activity Spreadsheet -- Enzyme Inhibition Constant Data from BindingDB
Found 2 hits for monomerid = 50208134
Trg + Lig
Ki
nM
ΔG°
kcal/mole
IC50
nM
Kd
nM
EC50/IC50
nM
koff
s-1
kon
M-1s-1
pHTemp
°C
Hydroxycarboxylic acid receptor 2
(Homo sapiens (Human))
BDBM50208134
(5-methyl-5-(4-methyl-thiophen-2-yl)-4-oxo-4,5-dihy...)
Show SMILES Cc1csc(c1)C1(C)OC(=CC1=O)C(O)=O |c:10|
Show InChI InChI=1S/C11H10O4S/c1-6-3-9(16-5-6)11(2)8(12)4-7(15-11)10(13)14/h3-5H,1-2H3,(H,13,14)
Reactome pathway
n/an/an/an/a 2.80E+3n/an/an/an/a
Arena Pharmaceuticals
Curated by ChEMBL
Assay Description
Activity at GPR109a in CHO cells assessed as inhibition of forskolin-induced cAMP generation
J Med Chem 50: 1445-8 (2007)
Article DOI: 10.1021/jm070022x
BindingDB Entry DOI: 10.7270/Q2BK1C1Z
HM74 nicotinic acid GPCR
(Homo sapiens (Human))
BDBM50208134
(5-methyl-5-(4-methyl-thiophen-2-yl)-4-oxo-4,5-dihy...)
Show SMILES Cc1csc(c1)C1(C)OC(=CC1=O)C(O)=O |c:10|
Show InChI InChI=1S/C11H10O4S/c1-6-3-9(16-5-6)11(2)8(12)4-7(15-11)10(13)14/h3-5H,1-2H3,(H,13,14)
n/an/an/an/a 1.80E+3n/an/an/an/a
Arena Pharmaceuticals
Curated by ChEMBL
Assay Description
Activity at GPR109b in CHO cells assessed as inhibition of forskolin-induced cAMP generation
J Med Chem 50: 1445-8 (2007)
Article DOI: 10.1021/jm070022x
BindingDB Entry DOI: 10.7270/Q2BK1C1Z