BDBM50208636 CHEMBL3884932
SMILES: COc1ccc2[nH]c3c(c(cc4cncc(OC)c34)C#N)c2c1
InChI Key: InChIKey=VTDMTVMKVZXVSP-UHFFFAOYSA-N
Data: 3 IC50
Activity Spreadsheet -- Enzyme Inhibition Constant Data from BindingDB
Found 3 hits for monomerid = 50208636
Trg + Lig
Ki
nM
ΔG°
kcal/mole
IC50
nM
Kd
nM
EC50/IC50
nM
koff
s-1
kon
M-1s-1
pHTemp
°C
Dual-specificity tyrosine-phosphorylation regulated kinase 1A
(Homo sapiens (Human))
BDBM50208636
(CHEMBL3884932)
Show SMILES COc1ccc2[nH]c3c(c(cc4cncc(OC)c34)C#N)c2c1
Show InChI InChI=1S/C18H13N3O2/c1-22-12-3-4-14-13(6-12)16-10(7-19)5-11-8-20-9-15(23-2)17(11)18(16)21-14/h3-6,8-9,21H,1-2H3
Reactome pathway
n/an/a 600n/an/an/an/an/an/a
CNRS
Curated by ChEMBL
Assay Description
Inhibition of GST-tagged human recombinant DYRK1A expressed in Escherichia coli using RS peptide as substrate incubated for 30 mins in presence of [g...
Eur J Med Chem 124: 920-934 (2016)
Article DOI: 10.1016/j.ejmech.2016.08.069
BindingDB Entry DOI: 10.7270/Q24X59S3
Cyclin-Dependent Kinase 5 (CDK5)
(Homo sapiens (Human))
BDBM50208636
(CHEMBL3884932)
Show SMILES COc1ccc2[nH]c3c(c(cc4cncc(OC)c34)C#N)c2c1
Show InChI InChI=1S/C18H13N3O2/c1-22-12-3-4-14-13(6-12)16-10(7-19)5-11-8-20-9-15(23-2)17(11)18(16)21-14/h3-6,8-9,21H,1-2H3
NCI pathway
Reactome pathway
n/an/a 930n/an/an/an/an/an/a
CNRS
Curated by ChEMBL
Assay Description
Inhibition of human recombinant CDK5/p25 using histone H1 as substrate after 30 mins in presence of [gamma-33 P] ATP by liquid scintillation counting...
Eur J Med Chem 124: 920-934 (2016)
Article DOI: 10.1016/j.ejmech.2016.08.069
BindingDB Entry DOI: 10.7270/Q24X59S3
Dual specificty protein kinase CLK1
(Homo sapiens (Human))
BDBM50208636
(CHEMBL3884932)
Show SMILES COc1ccc2[nH]c3c(c(cc4cncc(OC)c34)C#N)c2c1
Show InChI InChI=1S/C18H13N3O2/c1-22-12-3-4-14-13(6-12)16-10(7-19)5-11-8-20-9-15(23-2)17(11)18(16)21-14/h3-6,8-9,21H,1-2H3
n/an/a 56n/an/an/an/an/an/a
CNRS
Curated by ChEMBL
Assay Description
Inhibition of GST-tagged human recombinant CLK1 expressed in Escherichia coli using RS peptide as substrate incubated for 30 mins in presence of [gam...
Eur J Med Chem 124: 920-934 (2016)
Article DOI: 10.1016/j.ejmech.2016.08.069
BindingDB Entry DOI: 10.7270/Q24X59S3