BDBM50208916 CHEMBL3883398
SMILES: CC1(C)C(=O)N(c2nc(Nc3ccccc3)ncc12)c1ccccc1
InChI Key: InChIKey=WSEYPLGYXGUCPX-UHFFFAOYSA-N
Data: 2 IC50
Activity Spreadsheet -- Enzyme Inhibition Constant Data from BindingDB
Found 2 hits for monomerid = 50208916
Trg + Lig
Ki
nM
ΔG°
kcal/mole
IC50
nM
Kd
nM
EC50/IC50
nM
koff
s-1
kon
M-1s-1
pHTemp
°C
Serine/threonine-protein kinase c-TAK1
(Homo sapiens (Human))
BDBM50208916
(CHEMBL3883398)
Show SMILES CC1(C)C(=O)N(c2nc(Nc3ccccc3)ncc12)c1ccccc1
Show InChI InChI=1S/C20H18N4O/c1-20(2)16-13-21-19(22-14-9-5-3-6-10-14)23-17(16)24(18(20)25)15-11-7-4-8-12-15/h3-13H,1-2H3,(H,21,22,23)
n/an/a 2.80E+3n/an/an/an/an/an/a
Merck& Co.
Curated by ChEMBL
Assay Description
Inhibition of full length human MARK3 using biotin labeled peptide substrate by HTRF based assay
Bioorg Med Chem Lett 27: 114-120 (2017)
Article DOI: 10.1016/j.bmcl.2016.08.068
BindingDB Entry DOI: 10.7270/Q2N018JC
MAP/microtubule affinity-regulating kinase 4
(Homo sapiens (Human))
BDBM50208916
(CHEMBL3883398)
Show SMILES CC1(C)C(=O)N(c2nc(Nc3ccccc3)ncc12)c1ccccc1
Show InChI InChI=1S/C20H18N4O/c1-20(2)16-13-21-19(22-14-9-5-3-6-10-14)23-17(16)24(18(20)25)15-11-7-4-8-12-15/h3-13H,1-2H3,(H,21,22,23)
NCI pathway
Reactome pathway
n/an/a>1.00E+4n/an/an/an/an/an/a
Merck& Co.
Curated by ChEMBL
Assay Description
Inhibition of human MARK4 expressed in HEK293T cells coexpressing tau protein assessed as reduction in tau phosphorylation at Ser262 residues by Alph...
Bioorg Med Chem Lett 27: 114-120 (2017)
Article DOI: 10.1016/j.bmcl.2016.08.068
BindingDB Entry DOI: 10.7270/Q2N018JC